{"text_format":"1","workbook":"xlsx","n_sheets":5,"sheets":["MŠMT CSV","evidence","data","data1","Nápověda"],"not_rendered":{"charts":0,"images":0,"macros":1,"external_links":0,"defined_names":1,"comments":1,"pivot_tables":0},"unopened":[],"bounds":{"document_bytes":16777216,"sheet_cells":100000,"rows_first":2000,"rows_last":500,"rows_between":2000,"halvings":0,"cell_chars":16384,"cell_head_chars":4096},"cells_cut":0,"cells_raw":0,"read":"whole","date_system":"1900"}

{"sheet":"MŠMT CSV","index":0,"n_rows":201,"n_cols":26,"rows_kept":201,"cut":false,"hidden":false,"merged":[]}
["JMENO","PRIJMENI","TITUL_PRED","TITUL_ZA","RODNE_CISLO","OBCANSTVI","DATUM_NAROZENI","NAZEV_OBCE","NAZEV_CASTI_OBCE","NAZEV_ULICE","CISLO_POPISNE","CISLO_ORIENTACNI","PSC","SPORTOVEC","SPORTOVCEM_OD","SPORTOVCEM_DO","SPORTOVEC_CETNOST","SPORTOVEC_DRUH_SPORTU","SPORTOVEC_UCAST_SOUTEZE","TRENER","TRENEREM_OD","TRENEREM_DO","TRENER_CETNOST","TRENER_DRUH_SPORTU","EXT_ID"]
[{"$f":"IF(ISNUMBER(data1!AN2),data1!AA2,\"\")","v":""},{"$f":"IF(ISNUMBER(data1!AN2),data1!AB2,\"\")","v":""},null,null,{"$f":"IF(ISNUMBER(data1!AN2),data1!AE2,\"\")","v":""},{"$f":"IF(ISNUMBER(data1!AN2),data1!AF2,\"\")","v":""},{"$f":"IF(ISNUMBER(data1!AN2),data1!AG2,\"\")","v":""},null,null,null,null,null,null,{"$f":"IF(ISNUMBER(data1!AN2),data1!AN2,\"\")","v":""},{"$f":"IF(ISNUMBER(data1!AN2),data1!AO2,\"\")","v":""},null,null,{"$f":"IF(ISNUMBER(data1!AN2),data1!AR2,\"\")","v":""},null,{"$f":"IF(ISNUMBER(data1!AN2),data1!AT2,\"\")","v":""},null,null,null,{"$f":"IF(ISNUMBER(data1!AN2),data1!AX2,\"\")","v":""},null,{"$f":"data1!AZ2","v":0}]
[{"$f":"IF(ISNUMBER(data1!AN3),data1!AA3,\"\")","v":""},{"$f":"IF(ISNUMBER(data1!AN3),data1!AB3,\"\")","v":""},null,null,{"$f":"IF(ISNUMBER(data1!AN3),data1!AE3,\"\")","v":""},{"$f":"IF(ISNUMBER(data1!AN3),data1!AF3,\"\")","v":""},{"$f":"IF(ISNUMBER(data1!AN3),data1!AG3,\"\")","v":""},null,null,null,null,null,null,{"$f":"IF(ISNUMBER(data1!AN3),data1!AN3,\"\")","v":""},{"$f":"IF(ISNUMBER(data1!AN3),data1!AO3,\"\")","v":""},null,null,{"$f":"IF(ISNUMBER(data1!AN3),data1!AR3,\"\")","v":""},null,{"$f":"IF(ISNUMBER(data1!AN3),data1!AT3,\"\")","v":""},null,null,null,{"$f":"IF(ISNUMBER(data1!AN3),data1!AX3,\"\")","v":""}]
[{"$f":"IF(ISNUMBER(data1!AN4),data1!AA4,\"\")","v":""},{"$f":"IF(ISNUMBER(data1!AN4),data1!AB4,\"\")","v":""},null,null,{"$f":"IF(ISNUMBER(data1!AN4),data1!AE4,\"\")","v":""},{"$f":"IF(ISNUMBER(data1!AN4),data1!AF4,\"\")","v":""},{"$f":"IF(ISNUMBER(data1!AN4),data1!AG4,\"\")","v":""},null,null,null,null,null,null,{"$f":"IF(ISNUMBER(data1!AN4),data1!AN4,\"\")","v":""},{"$f":"IF(ISNUMBER(data1!AN4),data1!AO4,\"\")","v":""},null,null,{"$f":"IF(ISNUMBER(data1!AN4),data1!AR4,\"\")","v":""},null,{"$f":"IF(ISNUMBER(data1!AN4),data1!AT4,\"\")","v":""},null,null,null,{"$f":"IF(ISNUMBER(data1!AN4),data1!AX4,\"\")","v":""}]
[{"$f":"IF(ISNUMBER(data1!AN5),data1!AA5,\"\")","v":""},{"$f":"IF(ISNUMBER(data1!AN5),data1!AB5,\"\")","v":""},null,null,{"$f":"IF(ISNUMBER(data1!AN5),data1!AE5,\"\")","v":""},{"$f":"IF(ISNUMBER(data1!AN5),data1!AF5,\"\")","v":""},{"$f":"IF(ISNUMBER(data1!AN5),data1!AG5,\"\")","v":""},null,null,null,null,null,null,{"$f":"IF(ISNUMBER(data1!AN5),data1!AN5,\"\")","v":""},{"$f":"IF(ISNUMBER(data1!AN5),data1!AO5,\"\")","v":""},null,null,{"$f":"IF(ISNUMBER(data1!AN5),data1!AR5,\"\")","v":""},null,{"$f":"IF(ISNUMBER(data1!AN5),data1!AT5,\"\")","v":""},null,null,null,{"$f":"IF(ISNUMBER(data1!AN5),data1!AX5,\"\")","v":""}]
[{"$f":"IF(ISNUMBER(data1!AN6),data1!AA6,\"\")","v":""},{"$f":"IF(ISNUMBER(data1!AN6),data1!AB6,\"\")","v":""},null,null,{"$f":"IF(ISNUMBER(data1!AN6),data1!AE6,\"\")","v":""},{"$f":"IF(ISNUMBER(data1!AN6),data1!AF6,\"\")","v":""},{"$f":"IF(ISNUMBER(data1!AN6),data1!AG6,\"\")","v":""},null,null,null,null,null,null,{"$f":"IF(ISNUMBER(data1!AN6),data1!AN6,\"\")","v":""},{"$f":"IF(ISNUMBER(data1!AN6),data1!AO6,\"\")","v":""},null,null,{"$f":"IF(ISNUMBER(data1!AN6),data1!AR6,\"\")","v":""},null,{"$f":"IF(ISNUMBER(data1!AN6),data1!AT6,\"\")","v":""},null,null,null,{"$f":"IF(ISNUMBER(data1!AN6),data1!AX6,\"\")","v":""}]
[{"$f":"IF(ISNUMBER(data1!AN7),data1!AA7,\"\")","v":""},{"$f":"IF(ISNUMBER(data1!AN7),data1!AB7,\"\")","v":""},null,null,{"$f":"IF(ISNUMBER(data1!AN7),data1!AE7,\"\")","v":""},{"$f":"IF(ISNUMBER(data1!AN7),data1!AF7,\"\")","v":""},{"$f":"IF(ISNUMBER(data1!AN7),data1!AG7,\"\")","v":""},null,null,null,null,null,null,{"$f":"IF(ISNUMBER(data1!AN7),data1!AN7,\"\")","v":""},{"$f":"IF(ISNUMBER(data1!AN7),data1!AO7,\"\")","v":""},null,null,{"$f":"IF(ISNUMBER(data1!AN7),data1!AR7,\"\")","v":""},null,{"$f":"IF(ISNUMBER(data1!AN7),data1!AT7,\"\")","v":""},null,null,null,{"$f":"IF(ISNUMBER(data1!AN7),data1!AX7,\"\")","v":""}]
[{"$f":"IF(ISNUMBER(data1!AN8),data1!AA8,\"\")","v":""},{"$f":"IF(ISNUMBER(data1!AN8),data1!AB8,\"\")","v":""},null,null,{"$f":"IF(ISNUMBER(data1!AN8),data1!AE8,\"\")","v":""},{"$f":"IF(ISNUMBER(data1!AN8),data1!AF8,\"\")","v":""},{"$f":"IF(ISNUMBER(data1!AN8),data1!AG8,\"\")","v":""},null,null,null,null,null,null,{"$f":"IF(ISNUMBER(data1!AN8),data1!AN8,\"\")","v":""},{"$f":"IF(ISNUMBER(data1!AN8),data1!AO8,\"\")","v":""},null,null,{"$f":"IF(ISNUMBER(data1!AN8),data1!AR8,\"\")","v":""},null,{"$f":"IF(ISNUMBER(data1!AN8),data1!AT8,\"\")","v":""},null,null,null,{"$f":"IF(ISNUMBER(data1!AN8),data1!AX8,\"\")","v":""}]
[{"$f":"IF(ISNUMBER(data1!AN9),data1!AA9,\"\")","v":""},{"$f":"IF(ISNUMBER(data1!AN9),data1!AB9,\"\")","v":""},null,null,{"$f":"IF(ISNUMBER(data1!AN9),data1!AE9,\"\")","v":""},{"$f":"IF(ISNUMBER(data1!AN9),data1!AF9,\"\")","v":""},{"$f":"IF(ISNUMBER(data1!AN9),data1!AG9,\"\")","v":""},null,null,null,null,null,null,{"$f":"IF(ISNUMBER(data1!AN9),data1!AN9,\"\")","v":""},{"$f":"IF(ISNUMBER(data1!AN9),data1!AO9,\"\")","v":""},null,null,{"$f":"IF(ISNUMBER(data1!AN9),data1!AR9,\"\")","v":""},null,{"$f":"IF(ISNUMBER(data1!AN9),data1!AT9,\"\")","v":""},null,null,null,{"$f":"IF(ISNUMBER(data1!AN9),data1!AX9,\"\")","v":""}]
[{"$f":"IF(ISNUMBER(data1!AN10),data1!AA10,\"\")","v":""},{"$f":"IF(ISNUMBER(data1!AN10),data1!AB10,\"\")","v":""},null,null,{"$f":"IF(ISNUMBER(data1!AN10),data1!AE10,\"\")","v":""},{"$f":"IF(ISNUMBER(data1!AN10),data1!AF10,\"\")","v":""},{"$f":"IF(ISNUMBER(data1!AN10),data1!AG10,\"\")","v":""},null,null,null,null,null,null,{"$f":"IF(ISNUMBER(data1!AN10),data1!AN10,\"\")","v":""},{"$f":"IF(ISNUMBER(data1!AN10),data1!AO10,\"\")","v":""},null,null,{"$f":"IF(ISNUMBER(data1!AN10),data1!AR10,\"\")","v":""},null,{"$f":"IF(ISNUMBER(data1!AN10),data1!AT10,\"\")","v":""},null,null,null,{"$f":"IF(ISNUMBER(data1!AN10),data1!AX10,\"\")","v":""}]
[{"$f":"IF(ISNUMBER(data1!AN11),data1!AA11,\"\")","v":""},{"$f":"IF(ISNUMBER(data1!AN11),data1!AB11,\"\")","v":""},null,null,{"$f":"IF(ISNUMBER(data1!AN11),data1!AE11,\"\")","v":""},{"$f":"IF(ISNUMBER(data1!AN11),data1!AF11,\"\")","v":""},{"$f":"IF(ISNUMBER(data1!AN11),data1!AG11,\"\")","v":""},null,null,null,null,null,null,{"$f":"IF(ISNUMBER(data1!AN11),data1!AN11,\"\")","v":""},{"$f":"IF(ISNUMBER(data1!AN11),data1!AO11,\"\")","v":""},null,null,{"$f":"IF(ISNUMBER(data1!AN11),data1!AR11,\"\")","v":""},null,{"$f":"IF(ISNUMBER(data1!AN11),data1!AT11,\"\")","v":""},null,null,null,{"$f":"IF(ISNUMBER(data1!AN11),data1!AX11,\"\")","v":""}]
[{"$f":"IF(ISNUMBER(data1!AN12),data1!AA12,\"\")","v":""},{"$f":"IF(ISNUMBER(data1!AN12),data1!AB12,\"\")","v":""},null,null,{"$f":"IF(ISNUMBER(data1!AN12),data1!AE12,\"\")","v":""},{"$f":"IF(ISNUMBER(data1!AN12),data1!AF12,\"\")","v":""},{"$f":"IF(ISNUMBER(data1!AN12),data1!AG12,\"\")","v":""},null,null,null,null,null,null,{"$f":"IF(ISNUMBER(data1!AN12),data1!AN12,\"\")","v":""},{"$f":"IF(ISNUMBER(data1!AN12),data1!AO12,\"\")","v":""},null,null,{"$f":"IF(ISNUMBER(data1!AN12),data1!AR12,\"\")","v":""},null,{"$f":"IF(ISNUMBER(data1!AN12),data1!AT12,\"\")","v":""},null,null,null,{"$f":"IF(ISNUMBER(data1!AN12),data1!AX12,\"\")","v":""}]
[{"$f":"IF(ISNUMBER(data1!AN13),data1!AA13,\"\")","v":""},{"$f":"IF(ISNUMBER(data1!AN13),data1!AB13,\"\")","v":""},null,null,{"$f":"IF(ISNUMBER(data1!AN13),data1!AE13,\"\")","v":""},{"$f":"IF(ISNUMBER(data1!AN13),data1!AF13,\"\")","v":""},{"$f":"IF(ISNUMBER(data1!AN13),data1!AG13,\"\")","v":""},null,null,null,null,null,null,{"$f":"IF(ISNUMBER(data1!AN13),data1!AN13,\"\")","v":""},{"$f":"IF(ISNUMBER(data1!AN13),data1!AO13,\"\")","v":""},null,null,{"$f":"IF(ISNUMBER(data1!AN13),data1!AR13,\"\")","v":""},null,{"$f":"IF(ISNUMBER(data1!AN13),data1!AT13,\"\")","v":""},null,null,null,{"$f":"IF(ISNUMBER(data1!AN13),data1!AX13,\"\")","v":""}]
[{"$f":"IF(ISNUMBER(data1!AN14),data1!AA14,\"\")","v":""},{"$f":"IF(ISNUMBER(data1!AN14),data1!AB14,\"\")","v":""},null,null,{"$f":"IF(ISNUMBER(data1!AN14),data1!AE14,\"\")","v":""},{"$f":"IF(ISNUMBER(data1!AN14),data1!AF14,\"\")","v":""},{"$f":"IF(ISNUMBER(data1!AN14),data1!AG14,\"\")","v":""},null,null,null,null,null,null,{"$f":"IF(ISNUMBER(data1!AN14),data1!AN14,\"\")","v":""},{"$f":"IF(ISNUMBER(data1!AN14),data1!AO14,\"\")","v":""},null,null,{"$f":"IF(ISNUMBER(data1!AN14),data1!AR14,\"\")","v":""},null,{"$f":"IF(ISNUMBER(data1!AN14),data1!AT14,\"\")","v":""},null,null,null,{"$f":"IF(ISNUMBER(data1!AN14),data1!AX14,\"\")","v":""}]
[{"$f":"IF(ISNUMBER(data1!AN15),data1!AA15,\"\")","v":""},{"$f":"IF(ISNUMBER(data1!AN15),data1!AB15,\"\")","v":""},null,null,{"$f":"IF(ISNUMBER(data1!AN15),data1!AE15,\"\")","v":""},{"$f":"IF(ISNUMBER(data1!AN15),data1!AF15,\"\")","v":""},{"$f":"IF(ISNUMBER(data1!AN15),data1!AG15,\"\")","v":""},null,null,null,null,null,null,{"$f":"IF(ISNUMBER(data1!AN15),data1!AN15,\"\")","v":""},{"$f":"IF(ISNUMBER(data1!AN15),data1!AO15,\"\")","v":""},null,null,{"$f":"IF(ISNUMBER(data1!AN15),data1!AR15,\"\")","v":""},null,{"$f":"IF(ISNUMBER(data1!AN15),data1!AT15,\"\")","v":""},null,null,null,{"$f":"IF(ISNUMBER(data1!AN15),data1!AX15,\"\")","v":""}]
[{"$f":"IF(ISNUMBER(data1!AN16),data1!AA16,\"\")","v":""},{"$f":"IF(ISNUMBER(data1!AN16),data1!AB16,\"\")","v":""},null,null,{"$f":"IF(ISNUMBER(data1!AN16),data1!AE16,\"\")","v":""},{"$f":"IF(ISNUMBER(data1!AN16),data1!AF16,\"\")","v":""},{"$f":"IF(ISNUMBER(data1!AN16),data1!AG16,\"\")","v":""},null,null,null,null,null,null,{"$f":"IF(ISNUMBER(data1!AN16),data1!AN16,\"\")","v":""},{"$f":"IF(ISNUMBER(data1!AN16),data1!AO16,\"\")","v":""},null,null,{"$f":"IF(ISNUMBER(data1!AN16),data1!AR16,\"\")","v":""},null,{"$f":"IF(ISNUMBER(data1!AN16),data1!AT16,\"\")","v":""},null,null,null,{"$f":"IF(ISNUMBER(data1!AN16),data1!AX16,\"\")","v":""}]
[{"$f":"IF(ISNUMBER(data1!AN17),data1!AA17,\"\")","v":""},{"$f":"IF(ISNUMBER(data1!AN17),data1!AB17,\"\")","v":""},null,null,{"$f":"IF(ISNUMBER(data1!AN17),data1!AE17,\"\")","v":""},{"$f":"IF(ISNUMBER(data1!AN17),data1!AF17,\"\")","v":""},{"$f":"IF(ISNUMBER(data1!AN17),data1!AG17,\"\")","v":""},null,null,null,null,null,null,{"$f":"IF(ISNUMBER(data1!AN17),data1!AN17,\"\")","v":""},{"$f":"IF(ISNUMBER(data1!AN17),data1!AO17,\"\")","v":""},null,null,{"$f":"IF(ISNUMBER(data1!AN17),data1!AR17,\"\")","v":""},null,{"$f":"IF(ISNUMBER(data1!AN17),data1!AT17,\"\")","v":""},null,null,null,{"$f":"IF(ISNUMBER(data1!AN17),data1!AX17,\"\")","v":""}]
[{"$f":"IF(ISNUMBER(data1!AN18),data1!AA18,\"\")","v":""},{"$f":"IF(ISNUMBER(data1!AN18),data1!AB18,\"\")","v":""},null,null,{"$f":"IF(ISNUMBER(data1!AN18),data1!AE18,\"\")","v":""},{"$f":"IF(ISNUMBER(data1!AN18),data1!AF18,\"\")","v":""},{"$f":"IF(ISNUMBER(data1!AN18),data1!AG18,\"\")","v":""},null,null,null,null,null,null,{"$f":"IF(ISNUMBER(data1!AN18),data1!AN18,\"\")","v":""},{"$f":"IF(ISNUMBER(data1!AN18),data1!AO18,\"\")","v":""},null,null,{"$f":"IF(ISNUMBER(data1!AN18),data1!AR18,\"\")","v":""},null,{"$f":"IF(ISNUMBER(data1!AN18),data1!AT18,\"\")","v":""},null,null,null,{"$f":"IF(ISNUMBER(data1!AN18),data1!AX18,\"\")","v":""}]
[{"$f":"IF(ISNUMBER(data1!AN19),data1!AA19,\"\")","v":""},{"$f":"IF(ISNUMBER(data1!AN19),data1!AB19,\"\")","v":""},null,null,{"$f":"IF(ISNUMBER(data1!AN19),data1!AE19,\"\")","v":""},{"$f":"IF(ISNUMBER(data1!AN19),data1!AF19,\"\")","v":""},{"$f":"IF(ISNUMBER(data1!AN19),data1!AG19,\"\")","v":""},null,null,null,null,null,null,{"$f":"IF(ISNUMBER(data1!AN19),data1!AN19,\"\")","v":""},{"$f":"IF(ISNUMBER(data1!AN19),data1!AO19,\"\")","v":""},null,null,{"$f":"IF(ISNUMBER(data1!AN19),data1!AR19,\"\")","v":""},null,{"$f":"IF(ISNUMBER(data1!AN19),data1!AT19,\"\")","v":""},null,null,null,{"$f":"IF(ISNUMBER(data1!AN19),data1!AX19,\"\")","v":""}]
[{"$f":"IF(ISNUMBER(data1!AN20),data1!AA20,\"\")","v":""},{"$f":"IF(ISNUMBER(data1!AN20),data1!AB20,\"\")","v":""},null,null,{"$f":"IF(ISNUMBER(data1!AN20),data1!AE20,\"\")","v":""},{"$f":"IF(ISNUMBER(data1!AN20),data1!AF20,\"\")","v":""},{"$f":"IF(ISNUMBER(data1!AN20),data1!AG20,\"\")","v":""},null,null,null,null,null,null,{"$f":"IF(ISNUMBER(data1!AN20),data1!AN20,\"\")","v":""},{"$f":"IF(ISNUMBER(data1!AN20),data1!AO20,\"\")","v":""},null,null,{"$f":"IF(ISNUMBER(data1!AN20),data1!AR20,\"\")","v":""},null,{"$f":"IF(ISNUMBER(data1!AN20),data1!AT20,\"\")","v":""},null,null,null,{"$f":"IF(ISNUMBER(data1!AN20),data1!AX20,\"\")","v":""}]
[{"$f":"IF(ISNUMBER(data1!AN21),data1!AA21,\"\")","v":""},{"$f":"IF(ISNUMBER(data1!AN21),data1!AB21,\"\")","v":""},null,null,{"$f":"IF(ISNUMBER(data1!AN21),data1!AE21,\"\")","v":""},{"$f":"IF(ISNUMBER(data1!AN21),data1!AF21,\"\")","v":""},{"$f":"IF(ISNUMBER(data1!AN21),data1!AG21,\"\")","v":""},null,null,null,null,null,null,{"$f":"IF(ISNUMBER(data1!AN21),data1!AN21,\"\")","v":""},{"$f":"IF(ISNUMBER(data1!AN21),data1!AO21,\"\")","v":""},null,null,{"$f":"IF(ISNUMBER(data1!AN21),data1!AR21,\"\")","v":""},null,{"$f":"IF(ISNUMBER(data1!AN21),data1!AT21,\"\")","v":""},null,null,null,{"$f":"IF(ISNUMBER(data1!AN21),data1!AX21,\"\")","v":""}]
[{"$f":"IF(ISNUMBER(data1!AN22),data1!AA22,\"\")","v":""},{"$f":"IF(ISNUMBER(data1!AN22),data1!AB22,\"\")","v":""},null,null,{"$f":"IF(ISNUMBER(data1!AN22),data1!AE22,\"\")","v":""},{"$f":"IF(ISNUMBER(data1!AN22),data1!AF22,\"\")","v":""},{"$f":"IF(ISNUMBER(data1!AN22),data1!AG22,\"\")","v":""},null,null,null,null,null,null,{"$f":"IF(ISNUMBER(data1!AN22),data1!AN22,\"\")","v":""},{"$f":"IF(ISNUMBER(data1!AN22),data1!AO22,\"\")","v":""},null,null,{"$f":"IF(ISNUMBER(data1!AN22),data1!AR22,\"\")","v":""},null,{"$f":"IF(ISNUMBER(data1!AN22),data1!AT22,\"\")","v":""},null,null,null,{"$f":"IF(ISNUMBER(data1!AN22),data1!AX22,\"\")","v":""}]
[{"$f":"IF(ISNUMBER(data1!AN23),data1!AA23,\"\")","v":""},{"$f":"IF(ISNUMBER(data1!AN23),data1!AB23,\"\")","v":""},null,null,{"$f":"IF(ISNUMBER(data1!AN23),data1!AE23,\"\")","v":""},{"$f":"IF(ISNUMBER(data1!AN23),data1!AF23,\"\")","v":""},{"$f":"IF(ISNUMBER(data1!AN23),data1!AG23,\"\")","v":""},null,null,null,null,null,null,{"$f":"IF(ISNUMBER(data1!AN23),data1!AN23,\"\")","v":""},{"$f":"IF(ISNUMBER(data1!AN23),data1!AO23,\"\")","v":""},null,null,{"$f":"IF(ISNUMBER(data1!AN23),data1!AR23,\"\")","v":""},null,{"$f":"IF(ISNUMBER(data1!AN23),data1!AT23,\"\")","v":""},null,null,null,{"$f":"IF(ISNUMBER(data1!AN23),data1!AX23,\"\")","v":""}]
[{"$f":"IF(ISNUMBER(data1!AN24),data1!AA24,\"\")","v":""},{"$f":"IF(ISNUMBER(data1!AN24),data1!AB24,\"\")","v":""},null,null,{"$f":"IF(ISNUMBER(data1!AN24),data1!AE24,\"\")","v":""},{"$f":"IF(ISNUMBER(data1!AN24),data1!AF24,\"\")","v":""},{"$f":"IF(ISNUMBER(data1!AN24),data1!AG24,\"\")","v":""},null,null,null,null,null,null,{"$f":"IF(ISNUMBER(data1!AN24),data1!AN24,\"\")","v":""},{"$f":"IF(ISNUMBER(data1!AN24),data1!AO24,\"\")","v":""},null,null,{"$f":"IF(ISNUMBER(data1!AN24),data1!AR24,\"\")","v":""},null,{"$f":"IF(ISNUMBER(data1!AN24),data1!AT24,\"\")","v":""},null,null,null,{"$f":"IF(ISNUMBER(data1!AN24),data1!AX24,\"\")","v":""}]
[{"$f":"IF(ISNUMBER(data1!AN25),data1!AA25,\"\")","v":""},{"$f":"IF(ISNUMBER(data1!AN25),data1!AB25,\"\")","v":""},null,null,{"$f":"IF(ISNUMBER(data1!AN25),data1!AE25,\"\")","v":""},{"$f":"IF(ISNUMBER(data1!AN25),data1!AF25,\"\")","v":""},{"$f":"IF(ISNUMBER(data1!AN25),data1!AG25,\"\")","v":""},null,null,null,null,null,null,{"$f":"IF(ISNUMBER(data1!AN25),data1!AN25,\"\")","v":""},{"$f":"IF(ISNUMBER(data1!AN25),data1!AO25,\"\")","v":""},null,null,{"$f":"IF(ISNUMBER(data1!AN25),data1!AR25,\"\")","v":""},null,{"$f":"IF(ISNUMBER(data1!AN25),data1!AT25,\"\")","v":""},null,null,null,{"$f":"IF(ISNUMBER(data1!AN25),data1!AX25,\"\")","v":""}]
[{"$f":"IF(ISNUMBER(data1!AN26),data1!AA26,\"\")","v":""},{"$f":"IF(ISNUMBER(data1!AN26),data1!AB26,\"\")","v":""},null,null,{"$f":"IF(ISNUMBER(data1!AN26),data1!AE26,\"\")","v":""},{"$f":"IF(ISNUMBER(data1!AN26),data1!AF26,\"\")","v":""},{"$f":"IF(ISNUMBER(data1!AN26),data1!AG26,\"\")","v":""},null,null,null,null,null,null,{"$f":"IF(ISNUMBER(data1!AN26),data1!AN26,\"\")","v":""},{"$f":"IF(ISNUMBER(data1!AN26),data1!AO26,\"\")","v":""},null,null,{"$f":"IF(ISNUMBER(data1!AN26),data1!AR26,\"\")","v":""},null,{"$f":"IF(ISNUMBER(data1!AN26),data1!AT26,\"\")","v":""},null,null,null,{"$f":"IF(ISNUMBER(data1!AN26),data1!AX26,\"\")","v":""}]
[{"$f":"IF(ISNUMBER(data1!AN27),data1!AA27,\"\")","v":""},{"$f":"IF(ISNUMBER(data1!AN27),data1!AB27,\"\")","v":""},null,null,{"$f":"IF(ISNUMBER(data1!AN27),data1!AE27,\"\")","v":""},{"$f":"IF(ISNUMBER(data1!AN27),data1!AF27,\"\")","v":""},{"$f":"IF(ISNUMBER(data1!AN27),data1!AG27,\"\")","v":""},null,null,null,null,null,null,{"$f":"IF(ISNUMBER(data1!AN27),data1!AN27,\"\")","v":""},{"$f":"IF(ISNUMBER(data1!AN27),data1!AO27,\"\")","v":""},null,null,{"$f":"IF(ISNUMBER(data1!AN27),data1!AR27,\"\")","v":""},null,{"$f":"IF(ISNUMBER(data1!AN27),data1!AT27,\"\")","v":""},null,null,null,{"$f":"IF(ISNUMBER(data1!AN27),data1!AX27,\"\")","v":""}]
[{"$f":"IF(ISNUMBER(data1!AN28),data1!AA28,\"\")","v":""},{"$f":"IF(ISNUMBER(data1!AN28),data1!AB28,\"\")","v":""},null,null,{"$f":"IF(ISNUMBER(data1!AN28),data1!AE28,\"\")","v":""},{"$f":"IF(ISNUMBER(data1!AN28),data1!AF28,\"\")","v":""},{"$f":"IF(ISNUMBER(data1!AN28),data1!AG28,\"\")","v":""},null,null,null,null,null,null,{"$f":"IF(ISNUMBER(data1!AN28),data1!AN28,\"\")","v":""},{"$f":"IF(ISNUMBER(data1!AN28),data1!AO28,\"\")","v":""},null,null,{"$f":"IF(ISNUMBER(data1!AN28),data1!AR28,\"\")","v":""},null,{"$f":"IF(ISNUMBER(data1!AN28),data1!AT28,\"\")","v":""},null,null,null,{"$f":"IF(ISNUMBER(data1!AN28),data1!AX28,\"\")","v":""}]
[{"$f":"IF(ISNUMBER(data1!AN29),data1!AA29,\"\")","v":""},{"$f":"IF(ISNUMBER(data1!AN29),data1!AB29,\"\")","v":""},null,null,{"$f":"IF(ISNUMBER(data1!AN29),data1!AE29,\"\")","v":""},{"$f":"IF(ISNUMBER(data1!AN29),data1!AF29,\"\")","v":""},{"$f":"IF(ISNUMBER(data1!AN29),data1!AG29,\"\")","v":""},null,null,null,null,null,null,{"$f":"IF(ISNUMBER(data1!AN29),data1!AN29,\"\")","v":""},{"$f":"IF(ISNUMBER(data1!AN29),data1!AO29,\"\")","v":""},null,null,{"$f":"IF(ISNUMBER(data1!AN29),data1!AR29,\"\")","v":""},null,{"$f":"IF(ISNUMBER(data1!AN29),data1!AT29,\"\")","v":""},null,null,null,{"$f":"IF(ISNUMBER(data1!AN29),data1!AX29,\"\")","v":""}]
[{"$f":"IF(ISNUMBER(data1!AN30),data1!AA30,\"\")","v":""},{"$f":"IF(ISNUMBER(data1!AN30),data1!AB30,\"\")","v":""},null,null,{"$f":"IF(ISNUMBER(data1!AN30),data1!AE30,\"\")","v":""},{"$f":"IF(ISNUMBER(data1!AN30),data1!AF30,\"\")","v":""},{"$f":"IF(ISNUMBER(data1!AN30),data1!AG30,\"\")","v":""},null,null,null,null,null,null,{"$f":"IF(ISNUMBER(data1!AN30),data1!AN30,\"\")","v":""},{"$f":"IF(ISNUMBER(data1!AN30),data1!AO30,\"\")","v":""},null,null,{"$f":"IF(ISNUMBER(data1!AN30),data1!AR30,\"\")","v":""},null,{"$f":"IF(ISNUMBER(data1!AN30),data1!AT30,\"\")","v":""},null,null,null,{"$f":"IF(ISNUMBER(data1!AN30),data1!AX30,\"\")","v":""}]
[{"$f":"IF(ISNUMBER(data1!AN31),data1!AA31,\"\")","v":""},{"$f":"IF(ISNUMBER(data1!AN31),data1!AB31,\"\")","v":""},null,null,{"$f":"IF(ISNUMBER(data1!AN31),data1!AE31,\"\")","v":""},{"$f":"IF(ISNUMBER(data1!AN31),data1!AF31,\"\")","v":""},{"$f":"IF(ISNUMBER(data1!AN31),data1!AG31,\"\")","v":""},null,null,null,null,null,null,{"$f":"IF(ISNUMBER(data1!AN31),data1!AN31,\"\")","v":""},{"$f":"IF(ISNUMBER(data1!AN31),data1!AO31,\"\")","v":""},null,null,{"$f":"IF(ISNUMBER(data1!AN31),data1!AR31,\"\")","v":""},null,{"$f":"IF(ISNUMBER(data1!AN31),data1!AT31,\"\")","v":""},null,null,null,{"$f":"IF(ISNUMBER(data1!AN31),data1!AX31,\"\")","v":""}]
[{"$f":"IF(ISNUMBER(data1!AN32),data1!AA32,\"\")","v":""},{"$f":"IF(ISNUMBER(data1!AN32),data1!AB32,\"\")","v":""},null,null,{"$f":"IF(ISNUMBER(data1!AN32),data1!AE32,\"\")","v":""},{"$f":"IF(ISNUMBER(data1!AN32),data1!AF32,\"\")","v":""},{"$f":"IF(ISNUMBER(data1!AN32),data1!AG32,\"\")","v":""},null,null,null,null,null,null,{"$f":"IF(ISNUMBER(data1!AN32),data1!AN32,\"\")","v":""},{"$f":"IF(ISNUMBER(data1!AN32),data1!AO32,\"\")","v":""},null,null,{"$f":"IF(ISNUMBER(data1!AN32),data1!AR32,\"\")","v":""},null,{"$f":"IF(ISNUMBER(data1!AN32),data1!AT32,\"\")","v":""},null,null,null,{"$f":"IF(ISNUMBER(data1!AN32),data1!AX32,\"\")","v":""}]
[{"$f":"IF(ISNUMBER(data1!AN33),data1!AA33,\"\")","v":""},{"$f":"IF(ISNUMBER(data1!AN33),data1!AB33,\"\")","v":""},null,null,{"$f":"IF(ISNUMBER(data1!AN33),data1!AE33,\"\")","v":""},{"$f":"IF(ISNUMBER(data1!AN33),data1!AF33,\"\")","v":""},{"$f":"IF(ISNUMBER(data1!AN33),data1!AG33,\"\")","v":""},null,null,null,null,null,null,{"$f":"IF(ISNUMBER(data1!AN33),data1!AN33,\"\")","v":""},{"$f":"IF(ISNUMBER(data1!AN33),data1!AO33,\"\")","v":""},null,null,{"$f":"IF(ISNUMBER(data1!AN33),data1!AR33,\"\")","v":""},null,{"$f":"IF(ISNUMBER(data1!AN33),data1!AT33,\"\")","v":""},null,null,null,{"$f":"IF(ISNUMBER(data1!AN33),data1!AX33,\"\")","v":""}]
[{"$f":"IF(ISNUMBER(data1!AN34),data1!AA34,\"\")","v":""},{"$f":"IF(ISNUMBER(data1!AN34),data1!AB34,\"\")","v":""},null,null,{"$f":"IF(ISNUMBER(data1!AN34),data1!AE34,\"\")","v":""},{"$f":"IF(ISNUMBER(data1!AN34),data1!AF34,\"\")","v":""},{"$f":"IF(ISNUMBER(data1!AN34),data1!AG34,\"\")","v":""},null,null,null,null,null,null,{"$f":"IF(ISNUMBER(data1!AN34),data1!AN34,\"\")","v":""},{"$f":"IF(ISNUMBER(data1!AN34),data1!AO34,\"\")","v":""},null,null,{"$f":"IF(ISNUMBER(data1!AN34),data1!AR34,\"\")","v":""},null,{"$f":"IF(ISNUMBER(data1!AN34),data1!AT34,\"\")","v":""},null,null,null,{"$f":"IF(ISNUMBER(data1!AN34),data1!AX34,\"\")","v":""}]
[{"$f":"IF(ISNUMBER(data1!AN35),data1!AA35,\"\")","v":""},{"$f":"IF(ISNUMBER(data1!AN35),data1!AB35,\"\")","v":""},null,null,{"$f":"IF(ISNUMBER(data1!AN35),data1!AE35,\"\")","v":""},{"$f":"IF(ISNUMBER(data1!AN35),data1!AF35,\"\")","v":""},{"$f":"IF(ISNUMBER(data1!AN35),data1!AG35,\"\")","v":""},null,null,null,null,null,null,{"$f":"IF(ISNUMBER(data1!AN35),data1!AN35,\"\")","v":""},{"$f":"IF(ISNUMBER(data1!AN35),data1!AO35,\"\")","v":""},null,null,{"$f":"IF(ISNUMBER(data1!AN35),data1!AR35,\"\")","v":""},null,{"$f":"IF(ISNUMBER(data1!AN35),data1!AT35,\"\")","v":""},null,null,null,{"$f":"IF(ISNUMBER(data1!AN35),data1!AX35,\"\")","v":""}]
[{"$f":"IF(ISNUMBER(data1!AN36),data1!AA36,\"\")","v":""},{"$f":"IF(ISNUMBER(data1!AN36),data1!AB36,\"\")","v":""},null,null,{"$f":"IF(ISNUMBER(data1!AN36),data1!AE36,\"\")","v":""},{"$f":"IF(ISNUMBER(data1!AN36),data1!AF36,\"\")","v":""},{"$f":"IF(ISNUMBER(data1!AN36),data1!AG36,\"\")","v":""},null,null,null,null,null,null,{"$f":"IF(ISNUMBER(data1!AN36),data1!AN36,\"\")","v":""},{"$f":"IF(ISNUMBER(data1!AN36),data1!AO36,\"\")","v":""},null,null,{"$f":"IF(ISNUMBER(data1!AN36),data1!AR36,\"\")","v":""},null,{"$f":"IF(ISNUMBER(data1!AN36),data1!AT36,\"\")","v":""},null,null,null,{"$f":"IF(ISNUMBER(data1!AN36),data1!AX36,\"\")","v":""}]
[{"$f":"IF(ISNUMBER(data1!AN37),data1!AA37,\"\")","v":""},{"$f":"IF(ISNUMBER(data1!AN37),data1!AB37,\"\")","v":""},null,null,{"$f":"IF(ISNUMBER(data1!AN37),data1!AE37,\"\")","v":""},{"$f":"IF(ISNUMBER(data1!AN37),data1!AF37,\"\")","v":""},{"$f":"IF(ISNUMBER(data1!AN37),data1!AG37,\"\")","v":""},null,null,null,null,null,null,{"$f":"IF(ISNUMBER(data1!AN37),data1!AN37,\"\")","v":""},{"$f":"IF(ISNUMBER(data1!AN37),data1!AO37,\"\")","v":""},null,null,{"$f":"IF(ISNUMBER(data1!AN37),data1!AR37,\"\")","v":""},null,{"$f":"IF(ISNUMBER(data1!AN37),data1!AT37,\"\")","v":""},null,null,null,{"$f":"IF(ISNUMBER(data1!AN37),data1!AX37,\"\")","v":""}]
[{"$f":"IF(ISNUMBER(data1!AN38),data1!AA38,\"\")","v":""},{"$f":"IF(ISNUMBER(data1!AN38),data1!AB38,\"\")","v":""},null,null,{"$f":"IF(ISNUMBER(data1!AN38),data1!AE38,\"\")","v":""},{"$f":"IF(ISNUMBER(data1!AN38),data1!AF38,\"\")","v":""},{"$f":"IF(ISNUMBER(data1!AN38),data1!AG38,\"\")","v":""},null,null,null,null,null,null,{"$f":"IF(ISNUMBER(data1!AN38),data1!AN38,\"\")","v":""},{"$f":"IF(ISNUMBER(data1!AN38),data1!AO38,\"\")","v":""},null,null,{"$f":"IF(ISNUMBER(data1!AN38),data1!AR38,\"\")","v":""},null,{"$f":"IF(ISNUMBER(data1!AN38),data1!AT38,\"\")","v":""},null,null,null,{"$f":"IF(ISNUMBER(data1!AN38),data1!AX38,\"\")","v":""}]
[{"$f":"IF(ISNUMBER(data1!AN39),data1!AA39,\"\")","v":""},{"$f":"IF(ISNUMBER(data1!AN39),data1!AB39,\"\")","v":""},null,null,{"$f":"IF(ISNUMBER(data1!AN39),data1!AE39,\"\")","v":""},{"$f":"IF(ISNUMBER(data1!AN39),data1!AF39,\"\")","v":""},{"$f":"IF(ISNUMBER(data1!AN39),data1!AG39,\"\")","v":""},null,null,null,null,null,null,{"$f":"IF(ISNUMBER(data1!AN39),data1!AN39,\"\")","v":""},{"$f":"IF(ISNUMBER(data1!AN39),data1!AO39,\"\")","v":""},null,null,{"$f":"IF(ISNUMBER(data1!AN39),data1!AR39,\"\")","v":""},null,{"$f":"IF(ISNUMBER(data1!AN39),data1!AT39,\"\")","v":""},null,null,null,{"$f":"IF(ISNUMBER(data1!AN39),data1!AX39,\"\")","v":""}]
[{"$f":"IF(ISNUMBER(data1!AN40),data1!AA40,\"\")","v":""},{"$f":"IF(ISNUMBER(data1!AN40),data1!AB40,\"\")","v":""},null,null,{"$f":"IF(ISNUMBER(data1!AN40),data1!AE40,\"\")","v":""},{"$f":"IF(ISNUMBER(data1!AN40),data1!AF40,\"\")","v":""},{"$f":"IF(ISNUMBER(data1!AN40),data1!AG40,\"\")","v":""},null,null,null,null,null,null,{"$f":"IF(ISNUMBER(data1!AN40),data1!AN40,\"\")","v":""},{"$f":"IF(ISNUMBER(data1!AN40),data1!AO40,\"\")","v":""},null,null,{"$f":"IF(ISNUMBER(data1!AN40),data1!AR40,\"\")","v":""},null,{"$f":"IF(ISNUMBER(data1!AN40),data1!AT40,\"\")","v":""},null,null,null,{"$f":"IF(ISNUMBER(data1!AN40),data1!AX40,\"\")","v":""}]
[{"$f":"IF(ISNUMBER(data1!AN41),data1!AA41,\"\")","v":""},{"$f":"IF(ISNUMBER(data1!AN41),data1!AB41,\"\")","v":""},null,null,{"$f":"IF(ISNUMBER(data1!AN41),data1!AE41,\"\")","v":""},{"$f":"IF(ISNUMBER(data1!AN41),data1!AF41,\"\")","v":""},{"$f":"IF(ISNUMBER(data1!AN41),data1!AG41,\"\")","v":""},null,null,null,null,null,null,{"$f":"IF(ISNUMBER(data1!AN41),data1!AN41,\"\")","v":""},{"$f":"IF(ISNUMBER(data1!AN41),data1!AO41,\"\")","v":""},null,null,{"$f":"IF(ISNUMBER(data1!AN41),data1!AR41,\"\")","v":""},null,{"$f":"IF(ISNUMBER(data1!AN41),data1!AT41,\"\")","v":""},null,null,null,{"$f":"IF(ISNUMBER(data1!AN41),data1!AX41,\"\")","v":""}]
[{"$f":"IF(ISNUMBER(data1!AN42),data1!AA42,\"\")","v":""},{"$f":"IF(ISNUMBER(data1!AN42),data1!AB42,\"\")","v":""},null,null,{"$f":"IF(ISNUMBER(data1!AN42),data1!AE42,\"\")","v":""},{"$f":"IF(ISNUMBER(data1!AN42),data1!AF42,\"\")","v":""},{"$f":"IF(ISNUMBER(data1!AN42),data1!AG42,\"\")","v":""},null,null,null,null,null,null,{"$f":"IF(ISNUMBER(data1!AN42),data1!AN42,\"\")","v":""},{"$f":"IF(ISNUMBER(data1!AN42),data1!AO42,\"\")","v":""},null,null,{"$f":"IF(ISNUMBER(data1!AN42),data1!AR42,\"\")","v":""},null,{"$f":"IF(ISNUMBER(data1!AN42),data1!AT42,\"\")","v":""},null,null,null,{"$f":"IF(ISNUMBER(data1!AN42),data1!AX42,\"\")","v":""}]
[{"$f":"IF(ISNUMBER(data1!AN43),data1!AA43,\"\")","v":""},{"$f":"IF(ISNUMBER(data1!AN43),data1!AB43,\"\")","v":""},null,null,{"$f":"IF(ISNUMBER(data1!AN43),data1!AE43,\"\")","v":""},{"$f":"IF(ISNUMBER(data1!AN43),data1!AF43,\"\")","v":""},{"$f":"IF(ISNUMBER(data1!AN43),data1!AG43,\"\")","v":""},null,null,null,null,null,null,{"$f":"IF(ISNUMBER(data1!AN43),data1!AN43,\"\")","v":""},{"$f":"IF(ISNUMBER(data1!AN43),data1!AO43,\"\")","v":""},null,null,{"$f":"IF(ISNUMBER(data1!AN43),data1!AR43,\"\")","v":""},null,{"$f":"IF(ISNUMBER(data1!AN43),data1!AT43,\"\")","v":""},null,null,null,{"$f":"IF(ISNUMBER(data1!AN43),data1!AX43,\"\")","v":""}]
[{"$f":"IF(ISNUMBER(data1!AN44),data1!AA44,\"\")","v":""},{"$f":"IF(ISNUMBER(data1!AN44),data1!AB44,\"\")","v":""},null,null,{"$f":"IF(ISNUMBER(data1!AN44),data1!AE44,\"\")","v":""},{"$f":"IF(ISNUMBER(data1!AN44),data1!AF44,\"\")","v":""},{"$f":"IF(ISNUMBER(data1!AN44),data1!AG44,\"\")","v":""},null,null,null,null,null,null,{"$f":"IF(ISNUMBER(data1!AN44),data1!AN44,\"\")","v":""},{"$f":"IF(ISNUMBER(data1!AN44),data1!AO44,\"\")","v":""},null,null,{"$f":"IF(ISNUMBER(data1!AN44),data1!AR44,\"\")","v":""},null,{"$f":"IF(ISNUMBER(data1!AN44),data1!AT44,\"\")","v":""},null,null,null,{"$f":"IF(ISNUMBER(data1!AN44),data1!AX44,\"\")","v":""}]
[{"$f":"IF(ISNUMBER(data1!AN45),data1!AA45,\"\")","v":""},{"$f":"IF(ISNUMBER(data1!AN45),data1!AB45,\"\")","v":""},null,null,{"$f":"IF(ISNUMBER(data1!AN45),data1!AE45,\"\")","v":""},{"$f":"IF(ISNUMBER(data1!AN45),data1!AF45,\"\")","v":""},{"$f":"IF(ISNUMBER(data1!AN45),data1!AG45,\"\")","v":""},null,null,null,null,null,null,{"$f":"IF(ISNUMBER(data1!AN45),data1!AN45,\"\")","v":""},{"$f":"IF(ISNUMBER(data1!AN45),data1!AO45,\"\")","v":""},null,null,{"$f":"IF(ISNUMBER(data1!AN45),data1!AR45,\"\")","v":""},null,{"$f":"IF(ISNUMBER(data1!AN45),data1!AT45,\"\")","v":""},null,null,null,{"$f":"IF(ISNUMBER(data1!AN45),data1!AX45,\"\")","v":""}]
[{"$f":"IF(ISNUMBER(data1!AN46),data1!AA46,\"\")","v":""},{"$f":"IF(ISNUMBER(data1!AN46),data1!AB46,\"\")","v":""},null,null,{"$f":"IF(ISNUMBER(data1!AN46),data1!AE46,\"\")","v":""},{"$f":"IF(ISNUMBER(data1!AN46),data1!AF46,\"\")","v":""},{"$f":"IF(ISNUMBER(data1!AN46),data1!AG46,\"\")","v":""},null,null,null,null,null,null,{"$f":"IF(ISNUMBER(data1!AN46),data1!AN46,\"\")","v":""},{"$f":"IF(ISNUMBER(data1!AN46),data1!AO46,\"\")","v":""},null,null,{"$f":"IF(ISNUMBER(data1!AN46),data1!AR46,\"\")","v":""},null,{"$f":"IF(ISNUMBER(data1!AN46),data1!AT46,\"\")","v":""},null,null,null,{"$f":"IF(ISNUMBER(data1!AN46),data1!AX46,\"\")","v":""}]
[{"$f":"IF(ISNUMBER(data1!AN47),data1!AA47,\"\")","v":""},{"$f":"IF(ISNUMBER(data1!AN47),data1!AB47,\"\")","v":""},null,null,{"$f":"IF(ISNUMBER(data1!AN47),data1!AE47,\"\")","v":""},{"$f":"IF(ISNUMBER(data1!AN47),data1!AF47,\"\")","v":""},{"$f":"IF(ISNUMBER(data1!AN47),data1!AG47,\"\")","v":""},null,null,null,null,null,null,{"$f":"IF(ISNUMBER(data1!AN47),data1!AN47,\"\")","v":""},{"$f":"IF(ISNUMBER(data1!AN47),data1!AO47,\"\")","v":""},null,null,{"$f":"IF(ISNUMBER(data1!AN47),data1!AR47,\"\")","v":""},null,{"$f":"IF(ISNUMBER(data1!AN47),data1!AT47,\"\")","v":""},null,null,null,{"$f":"IF(ISNUMBER(data1!AN47),data1!AX47,\"\")","v":""}]
[{"$f":"IF(ISNUMBER(data1!AN48),data1!AA48,\"\")","v":""},{"$f":"IF(ISNUMBER(data1!AN48),data1!AB48,\"\")","v":""},null,null,{"$f":"IF(ISNUMBER(data1!AN48),data1!AE48,\"\")","v":""},{"$f":"IF(ISNUMBER(data1!AN48),data1!AF48,\"\")","v":""},{"$f":"IF(ISNUMBER(data1!AN48),data1!AG48,\"\")","v":""},null,null,null,null,null,null,{"$f":"IF(ISNUMBER(data1!AN48),data1!AN48,\"\")","v":""},{"$f":"IF(ISNUMBER(data1!AN48),data1!AO48,\"\")","v":""},null,null,{"$f":"IF(ISNUMBER(data1!AN48),data1!AR48,\"\")","v":""},null,{"$f":"IF(ISNUMBER(data1!AN48),data1!AT48,\"\")","v":""},null,null,null,{"$f":"IF(ISNUMBER(data1!AN48),data1!AX48,\"\")","v":""}]
[{"$f":"IF(ISNUMBER(data1!AN49),data1!AA49,\"\")","v":""},{"$f":"IF(ISNUMBER(data1!AN49),data1!AB49,\"\")","v":""},null,null,{"$f":"IF(ISNUMBER(data1!AN49),data1!AE49,\"\")","v":""},{"$f":"IF(ISNUMBER(data1!AN49),data1!AF49,\"\")","v":""},{"$f":"IF(ISNUMBER(data1!AN49),data1!AG49,\"\")","v":""},null,null,null,null,null,null,{"$f":"IF(ISNUMBER(data1!AN49),data1!AN49,\"\")","v":""},{"$f":"IF(ISNUMBER(data1!AN49),data1!AO49,\"\")","v":""},null,null,{"$f":"IF(ISNUMBER(data1!AN49),data1!AR49,\"\")","v":""},null,{"$f":"IF(ISNUMBER(data1!AN49),data1!AT49,\"\")","v":""},null,null,null,{"$f":"IF(ISNUMBER(data1!AN49),data1!AX49,\"\")","v":""}]
[{"$f":"IF(ISNUMBER(data1!AN50),data1!AA50,\"\")","v":""},{"$f":"IF(ISNUMBER(data1!AN50),data1!AB50,\"\")","v":""},null,null,{"$f":"IF(ISNUMBER(data1!AN50),data1!AE50,\"\")","v":""},{"$f":"IF(ISNUMBER(data1!AN50),data1!AF50,\"\")","v":""},{"$f":"IF(ISNUMBER(data1!AN50),data1!AG50,\"\")","v":""},null,null,null,null,null,null,{"$f":"IF(ISNUMBER(data1!AN50),data1!AN50,\"\")","v":""},{"$f":"IF(ISNUMBER(data1!AN50),data1!AO50,\"\")","v":""},null,null,{"$f":"IF(ISNUMBER(data1!AN50),data1!AR50,\"\")","v":""},null,{"$f":"IF(ISNUMBER(data1!AN50),data1!AT50,\"\")","v":""},null,null,null,{"$f":"IF(ISNUMBER(data1!AN50),data1!AX50,\"\")","v":""}]
[{"$f":"IF(ISNUMBER(data1!AN51),data1!AA51,\"\")","v":""},{"$f":"IF(ISNUMBER(data1!AN51),data1!AB51,\"\")","v":""},null,null,{"$f":"IF(ISNUMBER(data1!AN51),data1!AE51,\"\")","v":""},{"$f":"IF(ISNUMBER(data1!AN51),data1!AF51,\"\")","v":""},{"$f":"IF(ISNUMBER(data1!AN51),data1!AG51,\"\")","v":""},null,null,null,null,null,null,{"$f":"IF(ISNUMBER(data1!AN51),data1!AN51,\"\")","v":""},{"$f":"IF(ISNUMBER(data1!AN51),data1!AO51,\"\")","v":""},null,null,{"$f":"IF(ISNUMBER(data1!AN51),data1!AR51,\"\")","v":""},null,{"$f":"IF(ISNUMBER(data1!AN51),data1!AT51,\"\")","v":""},null,null,null,{"$f":"IF(ISNUMBER(data1!AN51),data1!AX51,\"\")","v":""}]
[{"$f":"IF(ISNUMBER(data1!AN52),data1!AA52,\"\")","v":""},{"$f":"IF(ISNUMBER(data1!AN52),data1!AB52,\"\")","v":""},null,null,{"$f":"IF(ISNUMBER(data1!AN52),data1!AE52,\"\")","v":""},{"$f":"IF(ISNUMBER(data1!AN52),data1!AF52,\"\")","v":""},{"$f":"IF(ISNUMBER(data1!AN52),data1!AG52,\"\")","v":""},null,null,null,null,null,null,{"$f":"IF(ISNUMBER(data1!AN52),data1!AN52,\"\")","v":""},{"$f":"IF(ISNUMBER(data1!AN52),data1!AO52,\"\")","v":""},null,null,{"$f":"IF(ISNUMBER(data1!AN52),data1!AR52,\"\")","v":""},null,{"$f":"IF(ISNUMBER(data1!AN52),data1!AT52,\"\")","v":""},null,null,null,{"$f":"IF(ISNUMBER(data1!AN52),data1!AX52,\"\")","v":""}]
[{"$f":"IF(ISNUMBER(data1!AN53),data1!AA53,\"\")","v":""},{"$f":"IF(ISNUMBER(data1!AN53),data1!AB53,\"\")","v":""},null,null,{"$f":"IF(ISNUMBER(data1!AN53),data1!AE53,\"\")","v":""},{"$f":"IF(ISNUMBER(data1!AN53),data1!AF53,\"\")","v":""},{"$f":"IF(ISNUMBER(data1!AN53),data1!AG53,\"\")","v":""},null,null,null,null,null,null,{"$f":"IF(ISNUMBER(data1!AN53),data1!AN53,\"\")","v":""},{"$f":"IF(ISNUMBER(data1!AN53),data1!AO53,\"\")","v":""},null,null,{"$f":"IF(ISNUMBER(data1!AN53),data1!AR53,\"\")","v":""},null,{"$f":"IF(ISNUMBER(data1!AN53),data1!AT53,\"\")","v":""},null,null,null,{"$f":"IF(ISNUMBER(data1!AN53),data1!AX53,\"\")","v":""}]
[{"$f":"IF(ISNUMBER(data1!AN54),data1!AA54,\"\")","v":""},{"$f":"IF(ISNUMBER(data1!AN54),data1!AB54,\"\")","v":""},null,null,{"$f":"IF(ISNUMBER(data1!AN54),data1!AE54,\"\")","v":""},{"$f":"IF(ISNUMBER(data1!AN54),data1!AF54,\"\")","v":""},{"$f":"IF(ISNUMBER(data1!AN54),data1!AG54,\"\")","v":""},null,null,null,null,null,null,{"$f":"IF(ISNUMBER(data1!AN54),data1!AN54,\"\")","v":""},{"$f":"IF(ISNUMBER(data1!AN54),data1!AO54,\"\")","v":""},null,null,{"$f":"IF(ISNUMBER(data1!AN54),data1!AR54,\"\")","v":""},null,{"$f":"IF(ISNUMBER(data1!AN54),data1!AT54,\"\")","v":""},null,null,null,{"$f":"IF(ISNUMBER(data1!AN54),data1!AX54,\"\")","v":""}]
[{"$f":"IF(ISNUMBER(data1!AN55),data1!AA55,\"\")","v":""},{"$f":"IF(ISNUMBER(data1!AN55),data1!AB55,\"\")","v":""},null,null,{"$f":"IF(ISNUMBER(data1!AN55),data1!AE55,\"\")","v":""},{"$f":"IF(ISNUMBER(data1!AN55),data1!AF55,\"\")","v":""},{"$f":"IF(ISNUMBER(data1!AN55),data1!AG55,\"\")","v":""},null,null,null,null,null,null,{"$f":"IF(ISNUMBER(data1!AN55),data1!AN55,\"\")","v":""},{"$f":"IF(ISNUMBER(data1!AN55),data1!AO55,\"\")","v":""},null,null,{"$f":"IF(ISNUMBER(data1!AN55),data1!AR55,\"\")","v":""},null,{"$f":"IF(ISNUMBER(data1!AN55),data1!AT55,\"\")","v":""},null,null,null,{"$f":"IF(ISNUMBER(data1!AN55),data1!AX55,\"\")","v":""}]
[{"$f":"IF(ISNUMBER(data1!AN56),data1!AA56,\"\")","v":""},{"$f":"IF(ISNUMBER(data1!AN56),data1!AB56,\"\")","v":""},null,null,{"$f":"IF(ISNUMBER(data1!AN56),data1!AE56,\"\")","v":""},{"$f":"IF(ISNUMBER(data1!AN56),data1!AF56,\"\")","v":""},{"$f":"IF(ISNUMBER(data1!AN56),data1!AG56,\"\")","v":""},null,null,null,null,null,null,{"$f":"IF(ISNUMBER(data1!AN56),data1!AN56,\"\")","v":""},{"$f":"IF(ISNUMBER(data1!AN56),data1!AO56,\"\")","v":""},null,null,{"$f":"IF(ISNUMBER(data1!AN56),data1!AR56,\"\")","v":""},null,{"$f":"IF(ISNUMBER(data1!AN56),data1!AT56,\"\")","v":""},null,null,null,{"$f":"IF(ISNUMBER(data1!AN56),data1!AX56,\"\")","v":""}]
[{"$f":"IF(ISNUMBER(data1!AN57),data1!AA57,\"\")","v":""},{"$f":"IF(ISNUMBER(data1!AN57),data1!AB57,\"\")","v":""},null,null,{"$f":"IF(ISNUMBER(data1!AN57),data1!AE57,\"\")","v":""},{"$f":"IF(ISNUMBER(data1!AN57),data1!AF57,\"\")","v":""},{"$f":"IF(ISNUMBER(data1!AN57),data1!AG57,\"\")","v":""},null,null,null,null,null,null,{"$f":"IF(ISNUMBER(data1!AN57),data1!AN57,\"\")","v":""},{"$f":"IF(ISNUMBER(data1!AN57),data1!AO57,\"\")","v":""},null,null,{"$f":"IF(ISNUMBER(data1!AN57),data1!AR57,\"\")","v":""},null,{"$f":"IF(ISNUMBER(data1!AN57),data1!AT57,\"\")","v":""},null,null,null,{"$f":"IF(ISNUMBER(data1!AN57),data1!AX57,\"\")","v":""}]
[{"$f":"IF(ISNUMBER(data1!AN58),data1!AA58,\"\")","v":""},{"$f":"IF(ISNUMBER(data1!AN58),data1!AB58,\"\")","v":""},null,null,{"$f":"IF(ISNUMBER(data1!AN58),data1!AE58,\"\")","v":""},{"$f":"IF(ISNUMBER(data1!AN58),data1!AF58,\"\")","v":""},{"$f":"IF(ISNUMBER(data1!AN58),data1!AG58,\"\")","v":""},null,null,null,null,null,null,{"$f":"IF(ISNUMBER(data1!AN58),data1!AN58,\"\")","v":""},{"$f":"IF(ISNUMBER(data1!AN58),data1!AO58,\"\")","v":""},null,null,{"$f":"IF(ISNUMBER(data1!AN58),data1!AR58,\"\")","v":""},null,{"$f":"IF(ISNUMBER(data1!AN58),data1!AT58,\"\")","v":""},null,null,null,{"$f":"IF(ISNUMBER(data1!AN58),data1!AX58,\"\")","v":""}]
[{"$f":"IF(ISNUMBER(data1!AN59),data1!AA59,\"\")","v":""},{"$f":"IF(ISNUMBER(data1!AN59),data1!AB59,\"\")","v":""},null,null,{"$f":"IF(ISNUMBER(data1!AN59),data1!AE59,\"\")","v":""},{"$f":"IF(ISNUMBER(data1!AN59),data1!AF59,\"\")","v":""},{"$f":"IF(ISNUMBER(data1!AN59),data1!AG59,\"\")","v":""},null,null,null,null,null,null,{"$f":"IF(ISNUMBER(data1!AN59),data1!AN59,\"\")","v":""},{"$f":"IF(ISNUMBER(data1!AN59),data1!AO59,\"\")","v":""},null,null,{"$f":"IF(ISNUMBER(data1!AN59),data1!AR59,\"\")","v":""},null,{"$f":"IF(ISNUMBER(data1!AN59),data1!AT59,\"\")","v":""},null,null,null,{"$f":"IF(ISNUMBER(data1!AN59),data1!AX59,\"\")","v":""}]
[{"$f":"IF(ISNUMBER(data1!AN60),data1!AA60,\"\")","v":""},{"$f":"IF(ISNUMBER(data1!AN60),data1!AB60,\"\")","v":""},null,null,{"$f":"IF(ISNUMBER(data1!AN60),data1!AE60,\"\")","v":""},{"$f":"IF(ISNUMBER(data1!AN60),data1!AF60,\"\")","v":""},{"$f":"IF(ISNUMBER(data1!AN60),data1!AG60,\"\")","v":""},null,null,null,null,null,null,{"$f":"IF(ISNUMBER(data1!AN60),data1!AN60,\"\")","v":""},{"$f":"IF(ISNUMBER(data1!AN60),data1!AO60,\"\")","v":""},null,null,{"$f":"IF(ISNUMBER(data1!AN60),data1!AR60,\"\")","v":""},null,{"$f":"IF(ISNUMBER(data1!AN60),data1!AT60,\"\")","v":""},null,null,null,{"$f":"IF(ISNUMBER(data1!AN60),data1!AX60,\"\")","v":""}]
[{"$f":"IF(ISNUMBER(data1!AN61),data1!AA61,\"\")","v":""},{"$f":"IF(ISNUMBER(data1!AN61),data1!AB61,\"\")","v":""},null,null,{"$f":"IF(ISNUMBER(data1!AN61),data1!AE61,\"\")","v":""},{"$f":"IF(ISNUMBER(data1!AN61),data1!AF61,\"\")","v":""},{"$f":"IF(ISNUMBER(data1!AN61),data1!AG61,\"\")","v":""},null,null,null,null,null,null,{"$f":"IF(ISNUMBER(data1!AN61),data1!AN61,\"\")","v":""},{"$f":"IF(ISNUMBER(data1!AN61),data1!AO61,\"\")","v":""},null,null,{"$f":"IF(ISNUMBER(data1!AN61),data1!AR61,\"\")","v":""},null,{"$f":"IF(ISNUMBER(data1!AN61),data1!AT61,\"\")","v":""},null,null,null,{"$f":"IF(ISNUMBER(data1!AN61),data1!AX61,\"\")","v":""}]
[{"$f":"IF(ISNUMBER(data1!AN62),data1!AA62,\"\")","v":""},{"$f":"IF(ISNUMBER(data1!AN62),data1!AB62,\"\")","v":""},null,null,{"$f":"IF(ISNUMBER(data1!AN62),data1!AE62,\"\")","v":""},{"$f":"IF(ISNUMBER(data1!AN62),data1!AF62,\"\")","v":""},{"$f":"IF(ISNUMBER(data1!AN62),data1!AG62,\"\")","v":""},null,null,null,null,null,null,{"$f":"IF(ISNUMBER(data1!AN62),data1!AN62,\"\")","v":""},{"$f":"IF(ISNUMBER(data1!AN62),data1!AO62,\"\")","v":""},null,null,{"$f":"IF(ISNUMBER(data1!AN62),data1!AR62,\"\")","v":""},null,{"$f":"IF(ISNUMBER(data1!AN62),data1!AT62,\"\")","v":""},null,null,null,{"$f":"IF(ISNUMBER(data1!AN62),data1!AX62,\"\")","v":""}]
[{"$f":"IF(ISNUMBER(data1!AN63),data1!AA63,\"\")","v":""},{"$f":"IF(ISNUMBER(data1!AN63),data1!AB63,\"\")","v":""},null,null,{"$f":"IF(ISNUMBER(data1!AN63),data1!AE63,\"\")","v":""},{"$f":"IF(ISNUMBER(data1!AN63),data1!AF63,\"\")","v":""},{"$f":"IF(ISNUMBER(data1!AN63),data1!AG63,\"\")","v":""},null,null,null,null,null,null,{"$f":"IF(ISNUMBER(data1!AN63),data1!AN63,\"\")","v":""},{"$f":"IF(ISNUMBER(data1!AN63),data1!AO63,\"\")","v":""},null,null,{"$f":"IF(ISNUMBER(data1!AN63),data1!AR63,\"\")","v":""},null,{"$f":"IF(ISNUMBER(data1!AN63),data1!AT63,\"\")","v":""},null,null,null,{"$f":"IF(ISNUMBER(data1!AN63),data1!AX63,\"\")","v":""}]
[{"$f":"IF(ISNUMBER(data1!AN64),data1!AA64,\"\")","v":""},{"$f":"IF(ISNUMBER(data1!AN64),data1!AB64,\"\")","v":""},null,null,{"$f":"IF(ISNUMBER(data1!AN64),data1!AE64,\"\")","v":""},{"$f":"IF(ISNUMBER(data1!AN64),data1!AF64,\"\")","v":""},{"$f":"IF(ISNUMBER(data1!AN64),data1!AG64,\"\")","v":""},null,null,null,null,null,null,{"$f":"IF(ISNUMBER(data1!AN64),data1!AN64,\"\")","v":""},{"$f":"IF(ISNUMBER(data1!AN64),data1!AO64,\"\")","v":""},null,null,{"$f":"IF(ISNUMBER(data1!AN64),data1!AR64,\"\")","v":""},null,{"$f":"IF(ISNUMBER(data1!AN64),data1!AT64,\"\")","v":""},null,null,null,{"$f":"IF(ISNUMBER(data1!AN64),data1!AX64,\"\")","v":""}]
[{"$f":"IF(ISNUMBER(data1!AN65),data1!AA65,\"\")","v":""},{"$f":"IF(ISNUMBER(data1!AN65),data1!AB65,\"\")","v":""},null,null,{"$f":"IF(ISNUMBER(data1!AN65),data1!AE65,\"\")","v":""},{"$f":"IF(ISNUMBER(data1!AN65),data1!AF65,\"\")","v":""},{"$f":"IF(ISNUMBER(data1!AN65),data1!AG65,\"\")","v":""},null,null,null,null,null,null,{"$f":"IF(ISNUMBER(data1!AN65),data1!AN65,\"\")","v":""},{"$f":"IF(ISNUMBER(data1!AN65),data1!AO65,\"\")","v":""},null,null,{"$f":"IF(ISNUMBER(data1!AN65),data1!AR65,\"\")","v":""},null,{"$f":"IF(ISNUMBER(data1!AN65),data1!AT65,\"\")","v":""},null,null,null,{"$f":"IF(ISNUMBER(data1!AN65),data1!AX65,\"\")","v":""}]
[{"$f":"IF(ISNUMBER(data1!AN66),data1!AA66,\"\")","v":""},{"$f":"IF(ISNUMBER(data1!AN66),data1!AB66,\"\")","v":""},null,null,{"$f":"IF(ISNUMBER(data1!AN66),data1!AE66,\"\")","v":""},{"$f":"IF(ISNUMBER(data1!AN66),data1!AF66,\"\")","v":""},{"$f":"IF(ISNUMBER(data1!AN66),data1!AG66,\"\")","v":""},null,null,null,null,null,null,{"$f":"IF(ISNUMBER(data1!AN66),data1!AN66,\"\")","v":""},{"$f":"IF(ISNUMBER(data1!AN66),data1!AO66,\"\")","v":""},null,null,{"$f":"IF(ISNUMBER(data1!AN66),data1!AR66,\"\")","v":""},null,{"$f":"IF(ISNUMBER(data1!AN66),data1!AT66,\"\")","v":""},null,null,null,{"$f":"IF(ISNUMBER(data1!AN66),data1!AX66,\"\")","v":""}]
[{"$f":"IF(ISNUMBER(data1!AN67),data1!AA67,\"\")","v":""},{"$f":"IF(ISNUMBER(data1!AN67),data1!AB67,\"\")","v":""},null,null,{"$f":"IF(ISNUMBER(data1!AN67),data1!AE67,\"\")","v":""},{"$f":"IF(ISNUMBER(data1!AN67),data1!AF67,\"\")","v":""},{"$f":"IF(ISNUMBER(data1!AN67),data1!AG67,\"\")","v":""},null,null,null,null,null,null,{"$f":"IF(ISNUMBER(data1!AN67),data1!AN67,\"\")","v":""},{"$f":"IF(ISNUMBER(data1!AN67),data1!AO67,\"\")","v":""},null,null,{"$f":"IF(ISNUMBER(data1!AN67),data1!AR67,\"\")","v":""},null,{"$f":"IF(ISNUMBER(data1!AN67),data1!AT67,\"\")","v":""},null,null,null,{"$f":"IF(ISNUMBER(data1!AN67),data1!AX67,\"\")","v":""}]
[{"$f":"IF(ISNUMBER(data1!AN68),data1!AA68,\"\")","v":""},{"$f":"IF(ISNUMBER(data1!AN68),data1!AB68,\"\")","v":""},null,null,{"$f":"IF(ISNUMBER(data1!AN68),data1!AE68,\"\")","v":""},{"$f":"IF(ISNUMBER(data1!AN68),data1!AF68,\"\")","v":""},{"$f":"IF(ISNUMBER(data1!AN68),data1!AG68,\"\")","v":""},null,null,null,null,null,null,{"$f":"IF(ISNUMBER(data1!AN68),data1!AN68,\"\")","v":""},{"$f":"IF(ISNUMBER(data1!AN68),data1!AO68,\"\")","v":""},null,null,{"$f":"IF(ISNUMBER(data1!AN68),data1!AR68,\"\")","v":""},null,{"$f":"IF(ISNUMBER(data1!AN68),data1!AT68,\"\")","v":""},null,null,null,{"$f":"IF(ISNUMBER(data1!AN68),data1!AX68,\"\")","v":""}]
[{"$f":"IF(ISNUMBER(data1!AN69),data1!AA69,\"\")","v":""},{"$f":"IF(ISNUMBER(data1!AN69),data1!AB69,\"\")","v":""},null,null,{"$f":"IF(ISNUMBER(data1!AN69),data1!AE69,\"\")","v":""},{"$f":"IF(ISNUMBER(data1!AN69),data1!AF69,\"\")","v":""},{"$f":"IF(ISNUMBER(data1!AN69),data1!AG69,\"\")","v":""},null,null,null,null,null,null,{"$f":"IF(ISNUMBER(data1!AN69),data1!AN69,\"\")","v":""},{"$f":"IF(ISNUMBER(data1!AN69),data1!AO69,\"\")","v":""},null,null,{"$f":"IF(ISNUMBER(data1!AN69),data1!AR69,\"\")","v":""},null,{"$f":"IF(ISNUMBER(data1!AN69),data1!AT69,\"\")","v":""},null,null,null,{"$f":"IF(ISNUMBER(data1!AN69),data1!AX69,\"\")","v":""}]
[{"$f":"IF(ISNUMBER(data1!AN70),data1!AA70,\"\")","v":""},{"$f":"IF(ISNUMBER(data1!AN70),data1!AB70,\"\")","v":""},null,null,{"$f":"IF(ISNUMBER(data1!AN70),data1!AE70,\"\")","v":""},{"$f":"IF(ISNUMBER(data1!AN70),data1!AF70,\"\")","v":""},{"$f":"IF(ISNUMBER(data1!AN70),data1!AG70,\"\")","v":""},null,null,null,null,null,null,{"$f":"IF(ISNUMBER(data1!AN70),data1!AN70,\"\")","v":""},{"$f":"IF(ISNUMBER(data1!AN70),data1!AO70,\"\")","v":""},null,null,{"$f":"IF(ISNUMBER(data1!AN70),data1!AR70,\"\")","v":""},null,{"$f":"IF(ISNUMBER(data1!AN70),data1!AT70,\"\")","v":""},null,null,null,{"$f":"IF(ISNUMBER(data1!AN70),data1!AX70,\"\")","v":""}]
[{"$f":"IF(ISNUMBER(data1!AN71),data1!AA71,\"\")","v":""},{"$f":"IF(ISNUMBER(data1!AN71),data1!AB71,\"\")","v":""},null,null,{"$f":"IF(ISNUMBER(data1!AN71),data1!AE71,\"\")","v":""},{"$f":"IF(ISNUMBER(data1!AN71),data1!AF71,\"\")","v":""},{"$f":"IF(ISNUMBER(data1!AN71),data1!AG71,\"\")","v":""},null,null,null,null,null,null,{"$f":"IF(ISNUMBER(data1!AN71),data1!AN71,\"\")","v":""},{"$f":"IF(ISNUMBER(data1!AN71),data1!AO71,\"\")","v":""},null,null,{"$f":"IF(ISNUMBER(data1!AN71),data1!AR71,\"\")","v":""},null,{"$f":"IF(ISNUMBER(data1!AN71),data1!AT71,\"\")","v":""},null,null,null,{"$f":"IF(ISNUMBER(data1!AN71),data1!AX71,\"\")","v":""}]
[{"$f":"IF(ISNUMBER(data1!AN72),data1!AA72,\"\")","v":""},{"$f":"IF(ISNUMBER(data1!AN72),data1!AB72,\"\")","v":""},null,null,{"$f":"IF(ISNUMBER(data1!AN72),data1!AE72,\"\")","v":""},{"$f":"IF(ISNUMBER(data1!AN72),data1!AF72,\"\")","v":""},{"$f":"IF(ISNUMBER(data1!AN72),data1!AG72,\"\")","v":""},null,null,null,null,null,null,{"$f":"IF(ISNUMBER(data1!AN72),data1!AN72,\"\")","v":""},{"$f":"IF(ISNUMBER(data1!AN72),data1!AO72,\"\")","v":""},null,null,{"$f":"IF(ISNUMBER(data1!AN72),data1!AR72,\"\")","v":""},null,{"$f":"IF(ISNUMBER(data1!AN72),data1!AT72,\"\")","v":""},null,null,null,{"$f":"IF(ISNUMBER(data1!AN72),data1!AX72,\"\")","v":""}]
[{"$f":"IF(ISNUMBER(data1!AN73),data1!AA73,\"\")","v":""},{"$f":"IF(ISNUMBER(data1!AN73),data1!AB73,\"\")","v":""},null,null,{"$f":"IF(ISNUMBER(data1!AN73),data1!AE73,\"\")","v":""},{"$f":"IF(ISNUMBER(data1!AN73),data1!AF73,\"\")","v":""},{"$f":"IF(ISNUMBER(data1!AN73),data1!AG73,\"\")","v":""},null,null,null,null,null,null,{"$f":"IF(ISNUMBER(data1!AN73),data1!AN73,\"\")","v":""},{"$f":"IF(ISNUMBER(data1!AN73),data1!AO73,\"\")","v":""},null,null,{"$f":"IF(ISNUMBER(data1!AN73),data1!AR73,\"\")","v":""},null,{"$f":"IF(ISNUMBER(data1!AN73),data1!AT73,\"\")","v":""},null,null,null,{"$f":"IF(ISNUMBER(data1!AN73),data1!AX73,\"\")","v":""}]
[{"$f":"IF(ISNUMBER(data1!AN74),data1!AA74,\"\")","v":""},{"$f":"IF(ISNUMBER(data1!AN74),data1!AB74,\"\")","v":""},null,null,{"$f":"IF(ISNUMBER(data1!AN74),data1!AE74,\"\")","v":""},{"$f":"IF(ISNUMBER(data1!AN74),data1!AF74,\"\")","v":""},{"$f":"IF(ISNUMBER(data1!AN74),data1!AG74,\"\")","v":""},null,null,null,null,null,null,{"$f":"IF(ISNUMBER(data1!AN74),data1!AN74,\"\")","v":""},{"$f":"IF(ISNUMBER(data1!AN74),data1!AO74,\"\")","v":""},null,null,{"$f":"IF(ISNUMBER(data1!AN74),data1!AR74,\"\")","v":""},null,{"$f":"IF(ISNUMBER(data1!AN74),data1!AT74,\"\")","v":""},null,null,null,{"$f":"IF(ISNUMBER(data1!AN74),data1!AX74,\"\")","v":""}]
[{"$f":"IF(ISNUMBER(data1!AN75),data1!AA75,\"\")","v":""},{"$f":"IF(ISNUMBER(data1!AN75),data1!AB75,\"\")","v":""},null,null,{"$f":"IF(ISNUMBER(data1!AN75),data1!AE75,\"\")","v":""},{"$f":"IF(ISNUMBER(data1!AN75),data1!AF75,\"\")","v":""},{"$f":"IF(ISNUMBER(data1!AN75),data1!AG75,\"\")","v":""},null,null,null,null,null,null,{"$f":"IF(ISNUMBER(data1!AN75),data1!AN75,\"\")","v":""},{"$f":"IF(ISNUMBER(data1!AN75),data1!AO75,\"\")","v":""},null,null,{"$f":"IF(ISNUMBER(data1!AN75),data1!AR75,\"\")","v":""},null,{"$f":"IF(ISNUMBER(data1!AN75),data1!AT75,\"\")","v":""},null,null,null,{"$f":"IF(ISNUMBER(data1!AN75),data1!AX75,\"\")","v":""}]
[{"$f":"IF(ISNUMBER(data1!AN76),data1!AA76,\"\")","v":""},{"$f":"IF(ISNUMBER(data1!AN76),data1!AB76,\"\")","v":""},null,null,{"$f":"IF(ISNUMBER(data1!AN76),data1!AE76,\"\")","v":""},{"$f":"IF(ISNUMBER(data1!AN76),data1!AF76,\"\")","v":""},{"$f":"IF(ISNUMBER(data1!AN76),data1!AG76,\"\")","v":""},null,null,null,null,null,null,{"$f":"IF(ISNUMBER(data1!AN76),data1!AN76,\"\")","v":""},{"$f":"IF(ISNUMBER(data1!AN76),data1!AO76,\"\")","v":""},null,null,{"$f":"IF(ISNUMBER(data1!AN76),data1!AR76,\"\")","v":""},null,{"$f":"IF(ISNUMBER(data1!AN76),data1!AT76,\"\")","v":""},null,null,null,{"$f":"IF(ISNUMBER(data1!AN76),data1!AX76,\"\")","v":""}]
[{"$f":"IF(ISNUMBER(data1!AN77),data1!AA77,\"\")","v":""},{"$f":"IF(ISNUMBER(data1!AN77),data1!AB77,\"\")","v":""},null,null,{"$f":"IF(ISNUMBER(data1!AN77),data1!AE77,\"\")","v":""},{"$f":"IF(ISNUMBER(data1!AN77),data1!AF77,\"\")","v":""},{"$f":"IF(ISNUMBER(data1!AN77),data1!AG77,\"\")","v":""},null,null,null,null,null,null,{"$f":"IF(ISNUMBER(data1!AN77),data1!AN77,\"\")","v":""},{"$f":"IF(ISNUMBER(data1!AN77),data1!AO77,\"\")","v":""},null,null,{"$f":"IF(ISNUMBER(data1!AN77),data1!AR77,\"\")","v":""},null,{"$f":"IF(ISNUMBER(data1!AN77),data1!AT77,\"\")","v":""},null,null,null,{"$f":"IF(ISNUMBER(data1!AN77),data1!AX77,\"\")","v":""}]
[{"$f":"IF(ISNUMBER(data1!AN78),data1!AA78,\"\")","v":""},{"$f":"IF(ISNUMBER(data1!AN78),data1!AB78,\"\")","v":""},null,null,{"$f":"IF(ISNUMBER(data1!AN78),data1!AE78,\"\")","v":""},{"$f":"IF(ISNUMBER(data1!AN78),data1!AF78,\"\")","v":""},{"$f":"IF(ISNUMBER(data1!AN78),data1!AG78,\"\")","v":""},null,null,null,null,null,null,{"$f":"IF(ISNUMBER(data1!AN78),data1!AN78,\"\")","v":""},{"$f":"IF(ISNUMBER(data1!AN78),data1!AO78,\"\")","v":""},null,null,{"$f":"IF(ISNUMBER(data1!AN78),data1!AR78,\"\")","v":""},null,{"$f":"IF(ISNUMBER(data1!AN78),data1!AT78,\"\")","v":""},null,null,null,{"$f":"IF(ISNUMBER(data1!AN78),data1!AX78,\"\")","v":""}]
[{"$f":"IF(ISNUMBER(data1!AN79),data1!AA79,\"\")","v":""},{"$f":"IF(ISNUMBER(data1!AN79),data1!AB79,\"\")","v":""},null,null,{"$f":"IF(ISNUMBER(data1!AN79),data1!AE79,\"\")","v":""},{"$f":"IF(ISNUMBER(data1!AN79),data1!AF79,\"\")","v":""},{"$f":"IF(ISNUMBER(data1!AN79),data1!AG79,\"\")","v":""},null,null,null,null,null,null,{"$f":"IF(ISNUMBER(data1!AN79),data1!AN79,\"\")","v":""},{"$f":"IF(ISNUMBER(data1!AN79),data1!AO79,\"\")","v":""},null,null,{"$f":"IF(ISNUMBER(data1!AN79),data1!AR79,\"\")","v":""},null,{"$f":"IF(ISNUMBER(data1!AN79),data1!AT79,\"\")","v":""},null,null,null,{"$f":"IF(ISNUMBER(data1!AN79),data1!AX79,\"\")","v":""}]
[{"$f":"IF(ISNUMBER(data1!AN80),data1!AA80,\"\")","v":""},{"$f":"IF(ISNUMBER(data1!AN80),data1!AB80,\"\")","v":""},null,null,{"$f":"IF(ISNUMBER(data1!AN80),data1!AE80,\"\")","v":""},{"$f":"IF(ISNUMBER(data1!AN80),data1!AF80,\"\")","v":""},{"$f":"IF(ISNUMBER(data1!AN80),data1!AG80,\"\")","v":""},null,null,null,null,null,null,{"$f":"IF(ISNUMBER(data1!AN80),data1!AN80,\"\")","v":""},{"$f":"IF(ISNUMBER(data1!AN80),data1!AO80,\"\")","v":""},null,null,{"$f":"IF(ISNUMBER(data1!AN80),data1!AR80,\"\")","v":""},null,{"$f":"IF(ISNUMBER(data1!AN80),data1!AT80,\"\")","v":""},null,null,null,{"$f":"IF(ISNUMBER(data1!AN80),data1!AX80,\"\")","v":""}]
[{"$f":"IF(ISNUMBER(data1!AN81),data1!AA81,\"\")","v":""},{"$f":"IF(ISNUMBER(data1!AN81),data1!AB81,\"\")","v":""},null,null,{"$f":"IF(ISNUMBER(data1!AN81),data1!AE81,\"\")","v":""},{"$f":"IF(ISNUMBER(data1!AN81),data1!AF81,\"\")","v":""},{"$f":"IF(ISNUMBER(data1!AN81),data1!AG81,\"\")","v":""},null,null,null,null,null,null,{"$f":"IF(ISNUMBER(data1!AN81),data1!AN81,\"\")","v":""},{"$f":"IF(ISNUMBER(data1!AN81),data1!AO81,\"\")","v":""},null,null,{"$f":"IF(ISNUMBER(data1!AN81),data1!AR81,\"\")","v":""},null,{"$f":"IF(ISNUMBER(data1!AN81),data1!AT81,\"\")","v":""},null,null,null,{"$f":"IF(ISNUMBER(data1!AN81),data1!AX81,\"\")","v":""}]
[{"$f":"IF(ISNUMBER(data1!AN82),data1!AA82,\"\")","v":""},{"$f":"IF(ISNUMBER(data1!AN82),data1!AB82,\"\")","v":""},null,null,{"$f":"IF(ISNUMBER(data1!AN82),data1!AE82,\"\")","v":""},{"$f":"IF(ISNUMBER(data1!AN82),data1!AF82,\"\")","v":""},{"$f":"IF(ISNUMBER(data1!AN82),data1!AG82,\"\")","v":""},null,null,null,null,null,null,{"$f":"IF(ISNUMBER(data1!AN82),data1!AN82,\"\")","v":""},{"$f":"IF(ISNUMBER(data1!AN82),data1!AO82,\"\")","v":""},null,null,{"$f":"IF(ISNUMBER(data1!AN82),data1!AR82,\"\")","v":""},null,{"$f":"IF(ISNUMBER(data1!AN82),data1!AT82,\"\")","v":""},null,null,null,{"$f":"IF(ISNUMBER(data1!AN82),data1!AX82,\"\")","v":""}]
[{"$f":"IF(ISNUMBER(data1!AN83),data1!AA83,\"\")","v":""},{"$f":"IF(ISNUMBER(data1!AN83),data1!AB83,\"\")","v":""},null,null,{"$f":"IF(ISNUMBER(data1!AN83),data1!AE83,\"\")","v":""},{"$f":"IF(ISNUMBER(data1!AN83),data1!AF83,\"\")","v":""},{"$f":"IF(ISNUMBER(data1!AN83),data1!AG83,\"\")","v":""},null,null,null,null,null,null,{"$f":"IF(ISNUMBER(data1!AN83),data1!AN83,\"\")","v":""},{"$f":"IF(ISNUMBER(data1!AN83),data1!AO83,\"\")","v":""},null,null,{"$f":"IF(ISNUMBER(data1!AN83),data1!AR83,\"\")","v":""},null,{"$f":"IF(ISNUMBER(data1!AN83),data1!AT83,\"\")","v":""},null,null,null,{"$f":"IF(ISNUMBER(data1!AN83),data1!AX83,\"\")","v":""}]
[{"$f":"IF(ISNUMBER(data1!AN84),data1!AA84,\"\")","v":""},{"$f":"IF(ISNUMBER(data1!AN84),data1!AB84,\"\")","v":""},null,null,{"$f":"IF(ISNUMBER(data1!AN84),data1!AE84,\"\")","v":""},{"$f":"IF(ISNUMBER(data1!AN84),data1!AF84,\"\")","v":""},{"$f":"IF(ISNUMBER(data1!AN84),data1!AG84,\"\")","v":""},null,null,null,null,null,null,{"$f":"IF(ISNUMBER(data1!AN84),data1!AN84,\"\")","v":""},{"$f":"IF(ISNUMBER(data1!AN84),data1!AO84,\"\")","v":""},null,null,{"$f":"IF(ISNUMBER(data1!AN84),data1!AR84,\"\")","v":""},null,{"$f":"IF(ISNUMBER(data1!AN84),data1!AT84,\"\")","v":""},null,null,null,{"$f":"IF(ISNUMBER(data1!AN84),data1!AX84,\"\")","v":""}]
[{"$f":"IF(ISNUMBER(data1!AN85),data1!AA85,\"\")","v":""},{"$f":"IF(ISNUMBER(data1!AN85),data1!AB85,\"\")","v":""},null,null,{"$f":"IF(ISNUMBER(data1!AN85),data1!AE85,\"\")","v":""},{"$f":"IF(ISNUMBER(data1!AN85),data1!AF85,\"\")","v":""},{"$f":"IF(ISNUMBER(data1!AN85),data1!AG85,\"\")","v":""},null,null,null,null,null,null,{"$f":"IF(ISNUMBER(data1!AN85),data1!AN85,\"\")","v":""},{"$f":"IF(ISNUMBER(data1!AN85),data1!AO85,\"\")","v":""},null,null,{"$f":"IF(ISNUMBER(data1!AN85),data1!AR85,\"\")","v":""},null,{"$f":"IF(ISNUMBER(data1!AN85),data1!AT85,\"\")","v":""},null,null,null,{"$f":"IF(ISNUMBER(data1!AN85),data1!AX85,\"\")","v":""}]
[{"$f":"IF(ISNUMBER(data1!AN86),data1!AA86,\"\")","v":""},{"$f":"IF(ISNUMBER(data1!AN86),data1!AB86,\"\")","v":""},null,null,{"$f":"IF(ISNUMBER(data1!AN86),data1!AE86,\"\")","v":""},{"$f":"IF(ISNUMBER(data1!AN86),data1!AF86,\"\")","v":""},{"$f":"IF(ISNUMBER(data1!AN86),data1!AG86,\"\")","v":""},null,null,null,null,null,null,{"$f":"IF(ISNUMBER(data1!AN86),data1!AN86,\"\")","v":""},{"$f":"IF(ISNUMBER(data1!AN86),data1!AO86,\"\")","v":""},null,null,{"$f":"IF(ISNUMBER(data1!AN86),data1!AR86,\"\")","v":""},null,{"$f":"IF(ISNUMBER(data1!AN86),data1!AT86,\"\")","v":""},null,null,null,{"$f":"IF(ISNUMBER(data1!AN86),data1!AX86,\"\")","v":""}]
[{"$f":"IF(ISNUMBER(data1!AN87),data1!AA87,\"\")","v":""},{"$f":"IF(ISNUMBER(data1!AN87),data1!AB87,\"\")","v":""},null,null,{"$f":"IF(ISNUMBER(data1!AN87),data1!AE87,\"\")","v":""},{"$f":"IF(ISNUMBER(data1!AN87),data1!AF87,\"\")","v":""},{"$f":"IF(ISNUMBER(data1!AN87),data1!AG87,\"\")","v":""},null,null,null,null,null,null,{"$f":"IF(ISNUMBER(data1!AN87),data1!AN87,\"\")","v":""},{"$f":"IF(ISNUMBER(data1!AN87),data1!AO87,\"\")","v":""},null,null,{"$f":"IF(ISNUMBER(data1!AN87),data1!AR87,\"\")","v":""},null,{"$f":"IF(ISNUMBER(data1!AN87),data1!AT87,\"\")","v":""},null,null,null,{"$f":"IF(ISNUMBER(data1!AN87),data1!AX87,\"\")","v":""}]
[{"$f":"IF(ISNUMBER(data1!AN88),data1!AA88,\"\")","v":""},{"$f":"IF(ISNUMBER(data1!AN88),data1!AB88,\"\")","v":""},null,null,{"$f":"IF(ISNUMBER(data1!AN88),data1!AE88,\"\")","v":""},{"$f":"IF(ISNUMBER(data1!AN88),data1!AF88,\"\")","v":""},{"$f":"IF(ISNUMBER(data1!AN88),data1!AG88,\"\")","v":""},null,null,null,null,null,null,{"$f":"IF(ISNUMBER(data1!AN88),data1!AN88,\"\")","v":""},{"$f":"IF(ISNUMBER(data1!AN88),data1!AO88,\"\")","v":""},null,null,{"$f":"IF(ISNUMBER(data1!AN88),data1!AR88,\"\")","v":""},null,{"$f":"IF(ISNUMBER(data1!AN88),data1!AT88,\"\")","v":""},null,null,null,{"$f":"IF(ISNUMBER(data1!AN88),data1!AX88,\"\")","v":""}]
[{"$f":"IF(ISNUMBER(data1!AN89),data1!AA89,\"\")","v":""},{"$f":"IF(ISNUMBER(data1!AN89),data1!AB89,\"\")","v":""},null,null,{"$f":"IF(ISNUMBER(data1!AN89),data1!AE89,\"\")","v":""},{"$f":"IF(ISNUMBER(data1!AN89),data1!AF89,\"\")","v":""},{"$f":"IF(ISNUMBER(data1!AN89),data1!AG89,\"\")","v":""},null,null,null,null,null,null,{"$f":"IF(ISNUMBER(data1!AN89),data1!AN89,\"\")","v":""},{"$f":"IF(ISNUMBER(data1!AN89),data1!AO89,\"\")","v":""},null,null,{"$f":"IF(ISNUMBER(data1!AN89),data1!AR89,\"\")","v":""},null,{"$f":"IF(ISNUMBER(data1!AN89),data1!AT89,\"\")","v":""},null,null,null,{"$f":"IF(ISNUMBER(data1!AN89),data1!AX89,\"\")","v":""}]
[{"$f":"IF(ISNUMBER(data1!AN90),data1!AA90,\"\")","v":""},{"$f":"IF(ISNUMBER(data1!AN90),data1!AB90,\"\")","v":""},null,null,{"$f":"IF(ISNUMBER(data1!AN90),data1!AE90,\"\")","v":""},{"$f":"IF(ISNUMBER(data1!AN90),data1!AF90,\"\")","v":""},{"$f":"IF(ISNUMBER(data1!AN90),data1!AG90,\"\")","v":""},null,null,null,null,null,null,{"$f":"IF(ISNUMBER(data1!AN90),data1!AN90,\"\")","v":""},{"$f":"IF(ISNUMBER(data1!AN90),data1!AO90,\"\")","v":""},null,null,{"$f":"IF(ISNUMBER(data1!AN90),data1!AR90,\"\")","v":""},null,{"$f":"IF(ISNUMBER(data1!AN90),data1!AT90,\"\")","v":""},null,null,null,{"$f":"IF(ISNUMBER(data1!AN90),data1!AX90,\"\")","v":""}]
[{"$f":"IF(ISNUMBER(data1!AN91),data1!AA91,\"\")","v":""},{"$f":"IF(ISNUMBER(data1!AN91),data1!AB91,\"\")","v":""},null,null,{"$f":"IF(ISNUMBER(data1!AN91),data1!AE91,\"\")","v":""},{"$f":"IF(ISNUMBER(data1!AN91),data1!AF91,\"\")","v":""},{"$f":"IF(ISNUMBER(data1!AN91),data1!AG91,\"\")","v":""},null,null,null,null,null,null,{"$f":"IF(ISNUMBER(data1!AN91),data1!AN91,\"\")","v":""},{"$f":"IF(ISNUMBER(data1!AN91),data1!AO91,\"\")","v":""},null,null,{"$f":"IF(ISNUMBER(data1!AN91),data1!AR91,\"\")","v":""},null,{"$f":"IF(ISNUMBER(data1!AN91),data1!AT91,\"\")","v":""},null,null,null,{"$f":"IF(ISNUMBER(data1!AN91),data1!AX91,\"\")","v":""}]
[{"$f":"IF(ISNUMBER(data1!AN92),data1!AA92,\"\")","v":""},{"$f":"IF(ISNUMBER(data1!AN92),data1!AB92,\"\")","v":""},null,null,{"$f":"IF(ISNUMBER(data1!AN92),data1!AE92,\"\")","v":""},{"$f":"IF(ISNUMBER(data1!AN92),data1!AF92,\"\")","v":""},{"$f":"IF(ISNUMBER(data1!AN92),data1!AG92,\"\")","v":""},null,null,null,null,null,null,{"$f":"IF(ISNUMBER(data1!AN92),data1!AN92,\"\")","v":""},{"$f":"IF(ISNUMBER(data1!AN92),data1!AO92,\"\")","v":""},null,null,{"$f":"IF(ISNUMBER(data1!AN92),data1!AR92,\"\")","v":""},null,{"$f":"IF(ISNUMBER(data1!AN92),data1!AT92,\"\")","v":""},null,null,null,{"$f":"IF(ISNUMBER(data1!AN92),data1!AX92,\"\")","v":""}]
[{"$f":"IF(ISNUMBER(data1!AN93),data1!AA93,\"\")","v":""},{"$f":"IF(ISNUMBER(data1!AN93),data1!AB93,\"\")","v":""},null,null,{"$f":"IF(ISNUMBER(data1!AN93),data1!AE93,\"\")","v":""},{"$f":"IF(ISNUMBER(data1!AN93),data1!AF93,\"\")","v":""},{"$f":"IF(ISNUMBER(data1!AN93),data1!AG93,\"\")","v":""},null,null,null,null,null,null,{"$f":"IF(ISNUMBER(data1!AN93),data1!AN93,\"\")","v":""},{"$f":"IF(ISNUMBER(data1!AN93),data1!AO93,\"\")","v":""},null,null,{"$f":"IF(ISNUMBER(data1!AN93),data1!AR93,\"\")","v":""},null,{"$f":"IF(ISNUMBER(data1!AN93),data1!AT93,\"\")","v":""},null,null,null,{"$f":"IF(ISNUMBER(data1!AN93),data1!AX93,\"\")","v":""}]
[{"$f":"IF(ISNUMBER(data1!AN94),data1!AA94,\"\")","v":""},{"$f":"IF(ISNUMBER(data1!AN94),data1!AB94,\"\")","v":""},null,null,{"$f":"IF(ISNUMBER(data1!AN94),data1!AE94,\"\")","v":""},{"$f":"IF(ISNUMBER(data1!AN94),data1!AF94,\"\")","v":""},{"$f":"IF(ISNUMBER(data1!AN94),data1!AG94,\"\")","v":""},null,null,null,null,null,null,{"$f":"IF(ISNUMBER(data1!AN94),data1!AN94,\"\")","v":""},{"$f":"IF(ISNUMBER(data1!AN94),data1!AO94,\"\")","v":""},null,null,{"$f":"IF(ISNUMBER(data1!AN94),data1!AR94,\"\")","v":""},null,{"$f":"IF(ISNUMBER(data1!AN94),data1!AT94,\"\")","v":""},null,null,null,{"$f":"IF(ISNUMBER(data1!AN94),data1!AX94,\"\")","v":""}]
[{"$f":"IF(ISNUMBER(data1!AN95),data1!AA95,\"\")","v":""},{"$f":"IF(ISNUMBER(data1!AN95),data1!AB95,\"\")","v":""},null,null,{"$f":"IF(ISNUMBER(data1!AN95),data1!AE95,\"\")","v":""},{"$f":"IF(ISNUMBER(data1!AN95),data1!AF95,\"\")","v":""},{"$f":"IF(ISNUMBER(data1!AN95),data1!AG95,\"\")","v":""},null,null,null,null,null,null,{"$f":"IF(ISNUMBER(data1!AN95),data1!AN95,\"\")","v":""},{"$f":"IF(ISNUMBER(data1!AN95),data1!AO95,\"\")","v":""},null,null,{"$f":"IF(ISNUMBER(data1!AN95),data1!AR95,\"\")","v":""},null,{"$f":"IF(ISNUMBER(data1!AN95),data1!AT95,\"\")","v":""},null,null,null,{"$f":"IF(ISNUMBER(data1!AN95),data1!AX95,\"\")","v":""}]
[{"$f":"IF(ISNUMBER(data1!AN96),data1!AA96,\"\")","v":""},{"$f":"IF(ISNUMBER(data1!AN96),data1!AB96,\"\")","v":""},null,null,{"$f":"IF(ISNUMBER(data1!AN96),data1!AE96,\"\")","v":""},{"$f":"IF(ISNUMBER(data1!AN96),data1!AF96,\"\")","v":""},{"$f":"IF(ISNUMBER(data1!AN96),data1!AG96,\"\")","v":""},null,null,null,null,null,null,{"$f":"IF(ISNUMBER(data1!AN96),data1!AN96,\"\")","v":""},{"$f":"IF(ISNUMBER(data1!AN96),data1!AO96,\"\")","v":""},null,null,{"$f":"IF(ISNUMBER(data1!AN96),data1!AR96,\"\")","v":""},null,{"$f":"IF(ISNUMBER(data1!AN96),data1!AT96,\"\")","v":""},null,null,null,{"$f":"IF(ISNUMBER(data1!AN96),data1!AX96,\"\")","v":""}]
[{"$f":"IF(ISNUMBER(data1!AN97),data1!AA97,\"\")","v":""},{"$f":"IF(ISNUMBER(data1!AN97),data1!AB97,\"\")","v":""},null,null,{"$f":"IF(ISNUMBER(data1!AN97),data1!AE97,\"\")","v":""},{"$f":"IF(ISNUMBER(data1!AN97),data1!AF97,\"\")","v":""},{"$f":"IF(ISNUMBER(data1!AN97),data1!AG97,\"\")","v":""},null,null,null,null,null,null,{"$f":"IF(ISNUMBER(data1!AN97),data1!AN97,\"\")","v":""},{"$f":"IF(ISNUMBER(data1!AN97),data1!AO97,\"\")","v":""},null,null,{"$f":"IF(ISNUMBER(data1!AN97),data1!AR97,\"\")","v":""},null,{"$f":"IF(ISNUMBER(data1!AN97),data1!AT97,\"\")","v":""},null,null,null,{"$f":"IF(ISNUMBER(data1!AN97),data1!AX97,\"\")","v":""}]
[{"$f":"IF(ISNUMBER(data1!AN98),data1!AA98,\"\")","v":""},{"$f":"IF(ISNUMBER(data1!AN98),data1!AB98,\"\")","v":""},null,null,{"$f":"IF(ISNUMBER(data1!AN98),data1!AE98,\"\")","v":""},{"$f":"IF(ISNUMBER(data1!AN98),data1!AF98,\"\")","v":""},{"$f":"IF(ISNUMBER(data1!AN98),data1!AG98,\"\")","v":""},null,null,null,null,null,null,{"$f":"IF(ISNUMBER(data1!AN98),data1!AN98,\"\")","v":""},{"$f":"IF(ISNUMBER(data1!AN98),data1!AO98,\"\")","v":""},null,null,{"$f":"IF(ISNUMBER(data1!AN98),data1!AR98,\"\")","v":""},null,{"$f":"IF(ISNUMBER(data1!AN98),data1!AT98,\"\")","v":""},null,null,null,{"$f":"IF(ISNUMBER(data1!AN98),data1!AX98,\"\")","v":""}]
[{"$f":"IF(ISNUMBER(data1!AN99),data1!AA99,\"\")","v":""},{"$f":"IF(ISNUMBER(data1!AN99),data1!AB99,\"\")","v":""},null,null,{"$f":"IF(ISNUMBER(data1!AN99),data1!AE99,\"\")","v":""},{"$f":"IF(ISNUMBER(data1!AN99),data1!AF99,\"\")","v":""},{"$f":"IF(ISNUMBER(data1!AN99),data1!AG99,\"\")","v":""},null,null,null,null,null,null,{"$f":"IF(ISNUMBER(data1!AN99),data1!AN99,\"\")","v":""},{"$f":"IF(ISNUMBER(data1!AN99),data1!AO99,\"\")","v":""},null,null,{"$f":"IF(ISNUMBER(data1!AN99),data1!AR99,\"\")","v":""},null,{"$f":"IF(ISNUMBER(data1!AN99),data1!AT99,\"\")","v":""},null,null,null,{"$f":"IF(ISNUMBER(data1!AN99),data1!AX99,\"\")","v":""}]
[{"$f":"IF(ISNUMBER(data1!AN100),data1!AA100,\"\")","v":""},{"$f":"IF(ISNUMBER(data1!AN100),data1!AB100,\"\")","v":""},null,null,{"$f":"IF(ISNUMBER(data1!AN100),data1!AE100,\"\")","v":""},{"$f":"IF(ISNUMBER(data1!AN100),data1!AF100,\"\")","v":""},{"$f":"IF(ISNUMBER(data1!AN100),data1!AG100,\"\")","v":""},null,null,null,null,null,null,{"$f":"IF(ISNUMBER(data1!AN100),data1!AN100,\"\")","v":""},{"$f":"IF(ISNUMBER(data1!AN100),data1!AO100,\"\")","v":""},null,null,{"$f":"IF(ISNUMBER(data1!AN100),data1!AR100,\"\")","v":""},null,{"$f":"IF(ISNUMBER(data1!AN100),data1!AT100,\"\")","v":""},null,null,null,{"$f":"IF(ISNUMBER(data1!AN100),data1!AX100,\"\")","v":""}]
[{"$f":"IF(ISNUMBER(data1!AN101),data1!AA101,\"\")","v":""},{"$f":"IF(ISNUMBER(data1!AN101),data1!AB101,\"\")","v":""},null,null,{"$f":"IF(ISNUMBER(data1!AN101),data1!AE101,\"\")","v":""},{"$f":"IF(ISNUMBER(data1!AN101),data1!AF101,\"\")","v":""},{"$f":"IF(ISNUMBER(data1!AN101),data1!AG101,\"\")","v":""},null,null,null,null,null,null,{"$f":"IF(ISNUMBER(data1!AN101),data1!AN101,\"\")","v":""},{"$f":"IF(ISNUMBER(data1!AN101),data1!AO101,\"\")","v":""},null,null,{"$f":"IF(ISNUMBER(data1!AN101),data1!AR101,\"\")","v":""},null,{"$f":"IF(ISNUMBER(data1!AN101),data1!AT101,\"\")","v":""},null,null,null,{"$f":"IF(ISNUMBER(data1!AN101),data1!AX101,\"\")","v":""}]
[{"$f":"IF(ISNUMBER(data1!AN102),data1!AA102,\"\")","v":""},{"$f":"IF(ISNUMBER(data1!AN102),data1!AB102,\"\")","v":""},null,null,{"$f":"IF(ISNUMBER(data1!AN102),data1!AE102,\"\")","v":""},{"$f":"IF(ISNUMBER(data1!AN102),data1!AF102,\"\")","v":""},{"$f":"IF(ISNUMBER(data1!AN102),data1!AG102,\"\")","v":""},null,null,null,null,null,null,{"$f":"IF(ISNUMBER(data1!AN102),data1!AN102,\"\")","v":""},{"$f":"IF(ISNUMBER(data1!AN102),data1!AO102,\"\")","v":""},null,null,{"$f":"IF(ISNUMBER(data1!AN102),data1!AR102,\"\")","v":""},null,{"$f":"IF(ISNUMBER(data1!AN102),data1!AT102,\"\")","v":""},null,null,null,{"$f":"IF(ISNUMBER(data1!AN102),data1!AX102,\"\")","v":""}]
[{"$f":"IF(ISNUMBER(data1!AN103),data1!AA103,\"\")","v":""},{"$f":"IF(ISNUMBER(data1!AN103),data1!AB103,\"\")","v":""},null,null,{"$f":"IF(ISNUMBER(data1!AN103),data1!AE103,\"\")","v":""},{"$f":"IF(ISNUMBER(data1!AN103),data1!AF103,\"\")","v":""},{"$f":"IF(ISNUMBER(data1!AN103),data1!AG103,\"\")","v":""},null,null,null,null,null,null,{"$f":"IF(ISNUMBER(data1!AN103),data1!AN103,\"\")","v":""},{"$f":"IF(ISNUMBER(data1!AN103),data1!AO103,\"\")","v":""},null,null,{"$f":"IF(ISNUMBER(data1!AN103),data1!AR103,\"\")","v":""},null,{"$f":"IF(ISNUMBER(data1!AN103),data1!AT103,\"\")","v":""},null,null,null,{"$f":"IF(ISNUMBER(data1!AN103),data1!AX103,\"\")","v":""}]
[{"$f":"IF(ISNUMBER(data1!AN104),data1!AA104,\"\")","v":""},{"$f":"IF(ISNUMBER(data1!AN104),data1!AB104,\"\")","v":""},null,null,{"$f":"IF(ISNUMBER(data1!AN104),data1!AE104,\"\")","v":""},{"$f":"IF(ISNUMBER(data1!AN104),data1!AF104,\"\")","v":""},{"$f":"IF(ISNUMBER(data1!AN104),data1!AG104,\"\")","v":""},null,null,null,null,null,null,{"$f":"IF(ISNUMBER(data1!AN104),data1!AN104,\"\")","v":""},{"$f":"IF(ISNUMBER(data1!AN104),data1!AO104,\"\")","v":""},null,null,{"$f":"IF(ISNUMBER(data1!AN104),data1!AR104,\"\")","v":""},null,{"$f":"IF(ISNUMBER(data1!AN104),data1!AT104,\"\")","v":""},null,null,null,{"$f":"IF(ISNUMBER(data1!AN104),data1!AX104,\"\")","v":""}]
[{"$f":"IF(ISNUMBER(data1!AN105),data1!AA105,\"\")","v":""},{"$f":"IF(ISNUMBER(data1!AN105),data1!AB105,\"\")","v":""},null,null,{"$f":"IF(ISNUMBER(data1!AN105),data1!AE105,\"\")","v":""},{"$f":"IF(ISNUMBER(data1!AN105),data1!AF105,\"\")","v":""},{"$f":"IF(ISNUMBER(data1!AN105),data1!AG105,\"\")","v":""},null,null,null,null,null,null,{"$f":"IF(ISNUMBER(data1!AN105),data1!AN105,\"\")","v":""},{"$f":"IF(ISNUMBER(data1!AN105),data1!AO105,\"\")","v":""},null,null,{"$f":"IF(ISNUMBER(data1!AN105),data1!AR105,\"\")","v":""},null,{"$f":"IF(ISNUMBER(data1!AN105),data1!AT105,\"\")","v":""},null,null,null,{"$f":"IF(ISNUMBER(data1!AN105),data1!AX105,\"\")","v":""}]
[{"$f":"IF(ISNUMBER(data1!AN106),data1!AA106,\"\")","v":""},{"$f":"IF(ISNUMBER(data1!AN106),data1!AB106,\"\")","v":""},null,null,{"$f":"IF(ISNUMBER(data1!AN106),data1!AE106,\"\")","v":""},{"$f":"IF(ISNUMBER(data1!AN106),data1!AF106,\"\")","v":""},{"$f":"IF(ISNUMBER(data1!AN106),data1!AG106,\"\")","v":""},null,null,null,null,null,null,{"$f":"IF(ISNUMBER(data1!AN106),data1!AN106,\"\")","v":""},{"$f":"IF(ISNUMBER(data1!AN106),data1!AO106,\"\")","v":""},null,null,{"$f":"IF(ISNUMBER(data1!AN106),data1!AR106,\"\")","v":""},null,{"$f":"IF(ISNUMBER(data1!AN106),data1!AT106,\"\")","v":""},null,null,null,{"$f":"IF(ISNUMBER(data1!AN106),data1!AX106,\"\")","v":""}]
[{"$f":"IF(ISNUMBER(data1!AN107),data1!AA107,\"\")","v":""},{"$f":"IF(ISNUMBER(data1!AN107),data1!AB107,\"\")","v":""},null,null,{"$f":"IF(ISNUMBER(data1!AN107),data1!AE107,\"\")","v":""},{"$f":"IF(ISNUMBER(data1!AN107),data1!AF107,\"\")","v":""},{"$f":"IF(ISNUMBER(data1!AN107),data1!AG107,\"\")","v":""},null,null,null,null,null,null,{"$f":"IF(ISNUMBER(data1!AN107),data1!AN107,\"\")","v":""},{"$f":"IF(ISNUMBER(data1!AN107),data1!AO107,\"\")","v":""},null,null,{"$f":"IF(ISNUMBER(data1!AN107),data1!AR107,\"\")","v":""},null,{"$f":"IF(ISNUMBER(data1!AN107),data1!AT107,\"\")","v":""},null,null,null,{"$f":"IF(ISNUMBER(data1!AN107),data1!AX107,\"\")","v":""}]
[{"$f":"IF(ISNUMBER(data1!AN108),data1!AA108,\"\")","v":""},{"$f":"IF(ISNUMBER(data1!AN108),data1!AB108,\"\")","v":""},null,null,{"$f":"IF(ISNUMBER(data1!AN108),data1!AE108,\"\")","v":""},{"$f":"IF(ISNUMBER(data1!AN108),data1!AF108,\"\")","v":""},{"$f":"IF(ISNUMBER(data1!AN108),data1!AG108,\"\")","v":""},null,null,null,null,null,null,{"$f":"IF(ISNUMBER(data1!AN108),data1!AN108,\"\")","v":""},{"$f":"IF(ISNUMBER(data1!AN108),data1!AO108,\"\")","v":""},null,null,{"$f":"IF(ISNUMBER(data1!AN108),data1!AR108,\"\")","v":""},null,{"$f":"IF(ISNUMBER(data1!AN108),data1!AT108,\"\")","v":""},null,null,null,{"$f":"IF(ISNUMBER(data1!AN108),data1!AX108,\"\")","v":""}]
[{"$f":"IF(ISNUMBER(data1!AN109),data1!AA109,\"\")","v":""},{"$f":"IF(ISNUMBER(data1!AN109),data1!AB109,\"\")","v":""},null,null,{"$f":"IF(ISNUMBER(data1!AN109),data1!AE109,\"\")","v":""},{"$f":"IF(ISNUMBER(data1!AN109),data1!AF109,\"\")","v":""},{"$f":"IF(ISNUMBER(data1!AN109),data1!AG109,\"\")","v":""},null,null,null,null,null,null,{"$f":"IF(ISNUMBER(data1!AN109),data1!AN109,\"\")","v":""},{"$f":"IF(ISNUMBER(data1!AN109),data1!AO109,\"\")","v":""},null,null,{"$f":"IF(ISNUMBER(data1!AN109),data1!AR109,\"\")","v":""},null,{"$f":"IF(ISNUMBER(data1!AN109),data1!AT109,\"\")","v":""},null,null,null,{"$f":"IF(ISNUMBER(data1!AN109),data1!AX109,\"\")","v":""}]
[{"$f":"IF(ISNUMBER(data1!AN110),data1!AA110,\"\")","v":""},{"$f":"IF(ISNUMBER(data1!AN110),data1!AB110,\"\")","v":""},null,null,{"$f":"IF(ISNUMBER(data1!AN110),data1!AE110,\"\")","v":""},{"$f":"IF(ISNUMBER(data1!AN110),data1!AF110,\"\")","v":""},{"$f":"IF(ISNUMBER(data1!AN110),data1!AG110,\"\")","v":""},null,null,null,null,null,null,{"$f":"IF(ISNUMBER(data1!AN110),data1!AN110,\"\")","v":""},{"$f":"IF(ISNUMBER(data1!AN110),data1!AO110,\"\")","v":""},null,null,{"$f":"IF(ISNUMBER(data1!AN110),data1!AR110,\"\")","v":""},null,{"$f":"IF(ISNUMBER(data1!AN110),data1!AT110,\"\")","v":""},null,null,null,{"$f":"IF(ISNUMBER(data1!AN110),data1!AX110,\"\")","v":""}]
[{"$f":"IF(ISNUMBER(data1!AN111),data1!AA111,\"\")","v":""},{"$f":"IF(ISNUMBER(data1!AN111),data1!AB111,\"\")","v":""},null,null,{"$f":"IF(ISNUMBER(data1!AN111),data1!AE111,\"\")","v":""},{"$f":"IF(ISNUMBER(data1!AN111),data1!AF111,\"\")","v":""},{"$f":"IF(ISNUMBER(data1!AN111),data1!AG111,\"\")","v":""},null,null,null,null,null,null,{"$f":"IF(ISNUMBER(data1!AN111),data1!AN111,\"\")","v":""},{"$f":"IF(ISNUMBER(data1!AN111),data1!AO111,\"\")","v":""},null,null,{"$f":"IF(ISNUMBER(data1!AN111),data1!AR111,\"\")","v":""},null,{"$f":"IF(ISNUMBER(data1!AN111),data1!AT111,\"\")","v":""},null,null,null,{"$f":"IF(ISNUMBER(data1!AN111),data1!AX111,\"\")","v":""}]
[{"$f":"IF(ISNUMBER(data1!AN112),data1!AA112,\"\")","v":""},{"$f":"IF(ISNUMBER(data1!AN112),data1!AB112,\"\")","v":""},null,null,{"$f":"IF(ISNUMBER(data1!AN112),data1!AE112,\"\")","v":""},{"$f":"IF(ISNUMBER(data1!AN112),data1!AF112,\"\")","v":""},{"$f":"IF(ISNUMBER(data1!AN112),data1!AG112,\"\")","v":""},null,null,null,null,null,null,{"$f":"IF(ISNUMBER(data1!AN112),data1!AN112,\"\")","v":""},{"$f":"IF(ISNUMBER(data1!AN112),data1!AO112,\"\")","v":""},null,null,{"$f":"IF(ISNUMBER(data1!AN112),data1!AR112,\"\")","v":""},null,{"$f":"IF(ISNUMBER(data1!AN112),data1!AT112,\"\")","v":""},null,null,null,{"$f":"IF(ISNUMBER(data1!AN112),data1!AX112,\"\")","v":""}]
[{"$f":"IF(ISNUMBER(data1!AN113),data1!AA113,\"\")","v":""},{"$f":"IF(ISNUMBER(data1!AN113),data1!AB113,\"\")","v":""},null,null,{"$f":"IF(ISNUMBER(data1!AN113),data1!AE113,\"\")","v":""},{"$f":"IF(ISNUMBER(data1!AN113),data1!AF113,\"\")","v":""},{"$f":"IF(ISNUMBER(data1!AN113),data1!AG113,\"\")","v":""},null,null,null,null,null,null,{"$f":"IF(ISNUMBER(data1!AN113),data1!AN113,\"\")","v":""},{"$f":"IF(ISNUMBER(data1!AN113),data1!AO113,\"\")","v":""},null,null,{"$f":"IF(ISNUMBER(data1!AN113),data1!AR113,\"\")","v":""},null,{"$f":"IF(ISNUMBER(data1!AN113),data1!AT113,\"\")","v":""},null,null,null,{"$f":"IF(ISNUMBER(data1!AN113),data1!AX113,\"\")","v":""}]
[{"$f":"IF(ISNUMBER(data1!AN114),data1!AA114,\"\")","v":""},{"$f":"IF(ISNUMBER(data1!AN114),data1!AB114,\"\")","v":""},null,null,{"$f":"IF(ISNUMBER(data1!AN114),data1!AE114,\"\")","v":""},{"$f":"IF(ISNUMBER(data1!AN114),data1!AF114,\"\")","v":""},{"$f":"IF(ISNUMBER(data1!AN114),data1!AG114,\"\")","v":""},null,null,null,null,null,null,{"$f":"IF(ISNUMBER(data1!AN114),data1!AN114,\"\")","v":""},{"$f":"IF(ISNUMBER(data1!AN114),data1!AO114,\"\")","v":""},null,null,{"$f":"IF(ISNUMBER(data1!AN114),data1!AR114,\"\")","v":""},null,{"$f":"IF(ISNUMBER(data1!AN114),data1!AT114,\"\")","v":""},null,null,null,{"$f":"IF(ISNUMBER(data1!AN114),data1!AX114,\"\")","v":""}]
[{"$f":"IF(ISNUMBER(data1!AN115),data1!AA115,\"\")","v":""},{"$f":"IF(ISNUMBER(data1!AN115),data1!AB115,\"\")","v":""},null,null,{"$f":"IF(ISNUMBER(data1!AN115),data1!AE115,\"\")","v":""},{"$f":"IF(ISNUMBER(data1!AN115),data1!AF115,\"\")","v":""},{"$f":"IF(ISNUMBER(data1!AN115),data1!AG115,\"\")","v":""},null,null,null,null,null,null,{"$f":"IF(ISNUMBER(data1!AN115),data1!AN115,\"\")","v":""},{"$f":"IF(ISNUMBER(data1!AN115),data1!AO115,\"\")","v":""},null,null,{"$f":"IF(ISNUMBER(data1!AN115),data1!AR115,\"\")","v":""},null,{"$f":"IF(ISNUMBER(data1!AN115),data1!AT115,\"\")","v":""},null,null,null,{"$f":"IF(ISNUMBER(data1!AN115),data1!AX115,\"\")","v":""}]
[{"$f":"IF(ISNUMBER(data1!AN116),data1!AA116,\"\")","v":""},{"$f":"IF(ISNUMBER(data1!AN116),data1!AB116,\"\")","v":""},null,null,{"$f":"IF(ISNUMBER(data1!AN116),data1!AE116,\"\")","v":""},{"$f":"IF(ISNUMBER(data1!AN116),data1!AF116,\"\")","v":""},{"$f":"IF(ISNUMBER(data1!AN116),data1!AG116,\"\")","v":""},null,null,null,null,null,null,{"$f":"IF(ISNUMBER(data1!AN116),data1!AN116,\"\")","v":""},{"$f":"IF(ISNUMBER(data1!AN116),data1!AO116,\"\")","v":""},null,null,{"$f":"IF(ISNUMBER(data1!AN116),data1!AR116,\"\")","v":""},null,{"$f":"IF(ISNUMBER(data1!AN116),data1!AT116,\"\")","v":""},null,null,null,{"$f":"IF(ISNUMBER(data1!AN116),data1!AX116,\"\")","v":""}]
[{"$f":"IF(ISNUMBER(data1!AN117),data1!AA117,\"\")","v":""},{"$f":"IF(ISNUMBER(data1!AN117),data1!AB117,\"\")","v":""},null,null,{"$f":"IF(ISNUMBER(data1!AN117),data1!AE117,\"\")","v":""},{"$f":"IF(ISNUMBER(data1!AN117),data1!AF117,\"\")","v":""},{"$f":"IF(ISNUMBER(data1!AN117),data1!AG117,\"\")","v":""},null,null,null,null,null,null,{"$f":"IF(ISNUMBER(data1!AN117),data1!AN117,\"\")","v":""},{"$f":"IF(ISNUMBER(data1!AN117),data1!AO117,\"\")","v":""},null,null,{"$f":"IF(ISNUMBER(data1!AN117),data1!AR117,\"\")","v":""},null,{"$f":"IF(ISNUMBER(data1!AN117),data1!AT117,\"\")","v":""},null,null,null,{"$f":"IF(ISNUMBER(data1!AN117),data1!AX117,\"\")","v":""}]
[{"$f":"IF(ISNUMBER(data1!AN118),data1!AA118,\"\")","v":""},{"$f":"IF(ISNUMBER(data1!AN118),data1!AB118,\"\")","v":""},null,null,{"$f":"IF(ISNUMBER(data1!AN118),data1!AE118,\"\")","v":""},{"$f":"IF(ISNUMBER(data1!AN118),data1!AF118,\"\")","v":""},{"$f":"IF(ISNUMBER(data1!AN118),data1!AG118,\"\")","v":""},null,null,null,null,null,null,{"$f":"IF(ISNUMBER(data1!AN118),data1!AN118,\"\")","v":""},{"$f":"IF(ISNUMBER(data1!AN118),data1!AO118,\"\")","v":""},null,null,{"$f":"IF(ISNUMBER(data1!AN118),data1!AR118,\"\")","v":""},null,{"$f":"IF(ISNUMBER(data1!AN118),data1!AT118,\"\")","v":""},null,null,null,{"$f":"IF(ISNUMBER(data1!AN118),data1!AX118,\"\")","v":""}]
[{"$f":"IF(ISNUMBER(data1!AN119),data1!AA119,\"\")","v":""},{"$f":"IF(ISNUMBER(data1!AN119),data1!AB119,\"\")","v":""},null,null,{"$f":"IF(ISNUMBER(data1!AN119),data1!AE119,\"\")","v":""},{"$f":"IF(ISNUMBER(data1!AN119),data1!AF119,\"\")","v":""},{"$f":"IF(ISNUMBER(data1!AN119),data1!AG119,\"\")","v":""},null,null,null,null,null,null,{"$f":"IF(ISNUMBER(data1!AN119),data1!AN119,\"\")","v":""},{"$f":"IF(ISNUMBER(data1!AN119),data1!AO119,\"\")","v":""},null,null,{"$f":"IF(ISNUMBER(data1!AN119),data1!AR119,\"\")","v":""},null,{"$f":"IF(ISNUMBER(data1!AN119),data1!AT119,\"\")","v":""},null,null,null,{"$f":"IF(ISNUMBER(data1!AN119),data1!AX119,\"\")","v":""}]
[{"$f":"IF(ISNUMBER(data1!AN120),data1!AA120,\"\")","v":""},{"$f":"IF(ISNUMBER(data1!AN120),data1!AB120,\"\")","v":""},null,null,{"$f":"IF(ISNUMBER(data1!AN120),data1!AE120,\"\")","v":""},{"$f":"IF(ISNUMBER(data1!AN120),data1!AF120,\"\")","v":""},{"$f":"IF(ISNUMBER(data1!AN120),data1!AG120,\"\")","v":""},null,null,null,null,null,null,{"$f":"IF(ISNUMBER(data1!AN120),data1!AN120,\"\")","v":""},{"$f":"IF(ISNUMBER(data1!AN120),data1!AO120,\"\")","v":""},null,null,{"$f":"IF(ISNUMBER(data1!AN120),data1!AR120,\"\")","v":""},null,{"$f":"IF(ISNUMBER(data1!AN120),data1!AT120,\"\")","v":""},null,null,null,{"$f":"IF(ISNUMBER(data1!AN120),data1!AX120,\"\")","v":""}]
[{"$f":"IF(ISNUMBER(data1!AN121),data1!AA121,\"\")","v":""},{"$f":"IF(ISNUMBER(data1!AN121),data1!AB121,\"\")","v":""},null,null,{"$f":"IF(ISNUMBER(data1!AN121),data1!AE121,\"\")","v":""},{"$f":"IF(ISNUMBER(data1!AN121),data1!AF121,\"\")","v":""},{"$f":"IF(ISNUMBER(data1!AN121),data1!AG121,\"\")","v":""},null,null,null,null,null,null,{"$f":"IF(ISNUMBER(data1!AN121),data1!AN121,\"\")","v":""},{"$f":"IF(ISNUMBER(data1!AN121),data1!AO121,\"\")","v":""},null,null,{"$f":"IF(ISNUMBER(data1!AN121),data1!AR121,\"\")","v":""},null,{"$f":"IF(ISNUMBER(data1!AN121),data1!AT121,\"\")","v":""},null,null,null,{"$f":"IF(ISNUMBER(data1!AN121),data1!AX121,\"\")","v":""}]
[{"$f":"IF(ISNUMBER(data1!AN122),data1!AA122,\"\")","v":""},{"$f":"IF(ISNUMBER(data1!AN122),data1!AB122,\"\")","v":""},null,null,{"$f":"IF(ISNUMBER(data1!AN122),data1!AE122,\"\")","v":""},{"$f":"IF(ISNUMBER(data1!AN122),data1!AF122,\"\")","v":""},{"$f":"IF(ISNUMBER(data1!AN122),data1!AG122,\"\")","v":""},null,null,null,null,null,null,{"$f":"IF(ISNUMBER(data1!AN122),data1!AN122,\"\")","v":""},{"$f":"IF(ISNUMBER(data1!AN122),data1!AO122,\"\")","v":""},null,null,{"$f":"IF(ISNUMBER(data1!AN122),data1!AR122,\"\")","v":""},null,{"$f":"IF(ISNUMBER(data1!AN122),data1!AT122,\"\")","v":""},null,null,null,{"$f":"IF(ISNUMBER(data1!AN122),data1!AX122,\"\")","v":""}]
[{"$f":"IF(ISNUMBER(data1!AN123),data1!AA123,\"\")","v":""},{"$f":"IF(ISNUMBER(data1!AN123),data1!AB123,\"\")","v":""},null,null,{"$f":"IF(ISNUMBER(data1!AN123),data1!AE123,\"\")","v":""},{"$f":"IF(ISNUMBER(data1!AN123),data1!AF123,\"\")","v":""},{"$f":"IF(ISNUMBER(data1!AN123),data1!AG123,\"\")","v":""},null,null,null,null,null,null,{"$f":"IF(ISNUMBER(data1!AN123),data1!AN123,\"\")","v":""},{"$f":"IF(ISNUMBER(data1!AN123),data1!AO123,\"\")","v":""},null,null,{"$f":"IF(ISNUMBER(data1!AN123),data1!AR123,\"\")","v":""},null,{"$f":"IF(ISNUMBER(data1!AN123),data1!AT123,\"\")","v":""},null,null,null,{"$f":"IF(ISNUMBER(data1!AN123),data1!AX123,\"\")","v":""}]
[{"$f":"IF(ISNUMBER(data1!AN124),data1!AA124,\"\")","v":""},{"$f":"IF(ISNUMBER(data1!AN124),data1!AB124,\"\")","v":""},null,null,{"$f":"IF(ISNUMBER(data1!AN124),data1!AE124,\"\")","v":""},{"$f":"IF(ISNUMBER(data1!AN124),data1!AF124,\"\")","v":""},{"$f":"IF(ISNUMBER(data1!AN124),data1!AG124,\"\")","v":""},null,null,null,null,null,null,{"$f":"IF(ISNUMBER(data1!AN124),data1!AN124,\"\")","v":""},{"$f":"IF(ISNUMBER(data1!AN124),data1!AO124,\"\")","v":""},null,null,{"$f":"IF(ISNUMBER(data1!AN124),data1!AR124,\"\")","v":""},null,{"$f":"IF(ISNUMBER(data1!AN124),data1!AT124,\"\")","v":""},null,null,null,{"$f":"IF(ISNUMBER(data1!AN124),data1!AX124,\"\")","v":""}]
[{"$f":"IF(ISNUMBER(data1!AN125),data1!AA125,\"\")","v":""},{"$f":"IF(ISNUMBER(data1!AN125),data1!AB125,\"\")","v":""},null,null,{"$f":"IF(ISNUMBER(data1!AN125),data1!AE125,\"\")","v":""},{"$f":"IF(ISNUMBER(data1!AN125),data1!AF125,\"\")","v":""},{"$f":"IF(ISNUMBER(data1!AN125),data1!AG125,\"\")","v":""},null,null,null,null,null,null,{"$f":"IF(ISNUMBER(data1!AN125),data1!AN125,\"\")","v":""},{"$f":"IF(ISNUMBER(data1!AN125),data1!AO125,\"\")","v":""},null,null,{"$f":"IF(ISNUMBER(data1!AN125),data1!AR125,\"\")","v":""},null,{"$f":"IF(ISNUMBER(data1!AN125),data1!AT125,\"\")","v":""},null,null,null,{"$f":"IF(ISNUMBER(data1!AN125),data1!AX125,\"\")","v":""}]
[{"$f":"IF(ISNUMBER(data1!AN126),data1!AA126,\"\")","v":""},{"$f":"IF(ISNUMBER(data1!AN126),data1!AB126,\"\")","v":""},null,null,{"$f":"IF(ISNUMBER(data1!AN126),data1!AE126,\"\")","v":""},{"$f":"IF(ISNUMBER(data1!AN126),data1!AF126,\"\")","v":""},{"$f":"IF(ISNUMBER(data1!AN126),data1!AG126,\"\")","v":""},null,null,null,null,null,null,{"$f":"IF(ISNUMBER(data1!AN126),data1!AN126,\"\")","v":""},{"$f":"IF(ISNUMBER(data1!AN126),data1!AO126,\"\")","v":""},null,null,{"$f":"IF(ISNUMBER(data1!AN126),data1!AR126,\"\")","v":""},null,{"$f":"IF(ISNUMBER(data1!AN126),data1!AT126,\"\")","v":""},null,null,null,{"$f":"IF(ISNUMBER(data1!AN126),data1!AX126,\"\")","v":""}]
[{"$f":"IF(ISNUMBER(data1!AN127),data1!AA127,\"\")","v":""},{"$f":"IF(ISNUMBER(data1!AN127),data1!AB127,\"\")","v":""},null,null,{"$f":"IF(ISNUMBER(data1!AN127),data1!AE127,\"\")","v":""},{"$f":"IF(ISNUMBER(data1!AN127),data1!AF127,\"\")","v":""},{"$f":"IF(ISNUMBER(data1!AN127),data1!AG127,\"\")","v":""},null,null,null,null,null,null,{"$f":"IF(ISNUMBER(data1!AN127),data1!AN127,\"\")","v":""},{"$f":"IF(ISNUMBER(data1!AN127),data1!AO127,\"\")","v":""},null,null,{"$f":"IF(ISNUMBER(data1!AN127),data1!AR127,\"\")","v":""},null,{"$f":"IF(ISNUMBER(data1!AN127),data1!AT127,\"\")","v":""},null,null,null,{"$f":"IF(ISNUMBER(data1!AN127),data1!AX127,\"\")","v":""}]
[{"$f":"IF(ISNUMBER(data1!AN128),data1!AA128,\"\")","v":""},{"$f":"IF(ISNUMBER(data1!AN128),data1!AB128,\"\")","v":""},null,null,{"$f":"IF(ISNUMBER(data1!AN128),data1!AE128,\"\")","v":""},{"$f":"IF(ISNUMBER(data1!AN128),data1!AF128,\"\")","v":""},{"$f":"IF(ISNUMBER(data1!AN128),data1!AG128,\"\")","v":""},null,null,null,null,null,null,{"$f":"IF(ISNUMBER(data1!AN128),data1!AN128,\"\")","v":""},{"$f":"IF(ISNUMBER(data1!AN128),data1!AO128,\"\")","v":""},null,null,{"$f":"IF(ISNUMBER(data1!AN128),data1!AR128,\"\")","v":""},null,{"$f":"IF(ISNUMBER(data1!AN128),data1!AT128,\"\")","v":""},null,null,null,{"$f":"IF(ISNUMBER(data1!AN128),data1!AX128,\"\")","v":""}]
[{"$f":"IF(ISNUMBER(data1!AN129),data1!AA129,\"\")","v":""},{"$f":"IF(ISNUMBER(data1!AN129),data1!AB129,\"\")","v":""},null,null,{"$f":"IF(ISNUMBER(data1!AN129),data1!AE129,\"\")","v":""},{"$f":"IF(ISNUMBER(data1!AN129),data1!AF129,\"\")","v":""},{"$f":"IF(ISNUMBER(data1!AN129),data1!AG129,\"\")","v":""},null,null,null,null,null,null,{"$f":"IF(ISNUMBER(data1!AN129),data1!AN129,\"\")","v":""},{"$f":"IF(ISNUMBER(data1!AN129),data1!AO129,\"\")","v":""},null,null,{"$f":"IF(ISNUMBER(data1!AN129),data1!AR129,\"\")","v":""},null,{"$f":"IF(ISNUMBER(data1!AN129),data1!AT129,\"\")","v":""},null,null,null,{"$f":"IF(ISNUMBER(data1!AN129),data1!AX129,\"\")","v":""}]
[{"$f":"IF(ISNUMBER(data1!AN130),data1!AA130,\"\")","v":""},{"$f":"IF(ISNUMBER(data1!AN130),data1!AB130,\"\")","v":""},null,null,{"$f":"IF(ISNUMBER(data1!AN130),data1!AE130,\"\")","v":""},{"$f":"IF(ISNUMBER(data1!AN130),data1!AF130,\"\")","v":""},{"$f":"IF(ISNUMBER(data1!AN130),data1!AG130,\"\")","v":""},null,null,null,null,null,null,{"$f":"IF(ISNUMBER(data1!AN130),data1!AN130,\"\")","v":""},{"$f":"IF(ISNUMBER(data1!AN130),data1!AO130,\"\")","v":""},null,null,{"$f":"IF(ISNUMBER(data1!AN130),data1!AR130,\"\")","v":""},null,{"$f":"IF(ISNUMBER(data1!AN130),data1!AT130,\"\")","v":""},null,null,null,{"$f":"IF(ISNUMBER(data1!AN130),data1!AX130,\"\")","v":""}]
[{"$f":"IF(ISNUMBER(data1!AN131),data1!AA131,\"\")","v":""},{"$f":"IF(ISNUMBER(data1!AN131),data1!AB131,\"\")","v":""},null,null,{"$f":"IF(ISNUMBER(data1!AN131),data1!AE131,\"\")","v":""},{"$f":"IF(ISNUMBER(data1!AN131),data1!AF131,\"\")","v":""},{"$f":"IF(ISNUMBER(data1!AN131),data1!AG131,\"\")","v":""},null,null,null,null,null,null,{"$f":"IF(ISNUMBER(data1!AN131),data1!AN131,\"\")","v":""},{"$f":"IF(ISNUMBER(data1!AN131),data1!AO131,\"\")","v":""},null,null,{"$f":"IF(ISNUMBER(data1!AN131),data1!AR131,\"\")","v":""},null,{"$f":"IF(ISNUMBER(data1!AN131),data1!AT131,\"\")","v":""},null,null,null,{"$f":"IF(ISNUMBER(data1!AN131),data1!AX131,\"\")","v":""}]
[{"$f":"IF(ISNUMBER(data1!AN132),data1!AA132,\"\")","v":""},{"$f":"IF(ISNUMBER(data1!AN132),data1!AB132,\"\")","v":""},null,null,{"$f":"IF(ISNUMBER(data1!AN132),data1!AE132,\"\")","v":""},{"$f":"IF(ISNUMBER(data1!AN132),data1!AF132,\"\")","v":""},{"$f":"IF(ISNUMBER(data1!AN132),data1!AG132,\"\")","v":""},null,null,null,null,null,null,{"$f":"IF(ISNUMBER(data1!AN132),data1!AN132,\"\")","v":""},{"$f":"IF(ISNUMBER(data1!AN132),data1!AO132,\"\")","v":""},null,null,{"$f":"IF(ISNUMBER(data1!AN132),data1!AR132,\"\")","v":""},null,{"$f":"IF(ISNUMBER(data1!AN132),data1!AT132,\"\")","v":""},null,null,null,{"$f":"IF(ISNUMBER(data1!AN132),data1!AX132,\"\")","v":""}]
[{"$f":"IF(ISNUMBER(data1!AN133),data1!AA133,\"\")","v":""},{"$f":"IF(ISNUMBER(data1!AN133),data1!AB133,\"\")","v":""},null,null,{"$f":"IF(ISNUMBER(data1!AN133),data1!AE133,\"\")","v":""},{"$f":"IF(ISNUMBER(data1!AN133),data1!AF133,\"\")","v":""},{"$f":"IF(ISNUMBER(data1!AN133),data1!AG133,\"\")","v":""},null,null,null,null,null,null,{"$f":"IF(ISNUMBER(data1!AN133),data1!AN133,\"\")","v":""},{"$f":"IF(ISNUMBER(data1!AN133),data1!AO133,\"\")","v":""},null,null,{"$f":"IF(ISNUMBER(data1!AN133),data1!AR133,\"\")","v":""},null,{"$f":"IF(ISNUMBER(data1!AN133),data1!AT133,\"\")","v":""},null,null,null,{"$f":"IF(ISNUMBER(data1!AN133),data1!AX133,\"\")","v":""}]
[{"$f":"IF(ISNUMBER(data1!AN134),data1!AA134,\"\")","v":""},{"$f":"IF(ISNUMBER(data1!AN134),data1!AB134,\"\")","v":""},null,null,{"$f":"IF(ISNUMBER(data1!AN134),data1!AE134,\"\")","v":""},{"$f":"IF(ISNUMBER(data1!AN134),data1!AF134,\"\")","v":""},{"$f":"IF(ISNUMBER(data1!AN134),data1!AG134,\"\")","v":""},null,null,null,null,null,null,{"$f":"IF(ISNUMBER(data1!AN134),data1!AN134,\"\")","v":""},{"$f":"IF(ISNUMBER(data1!AN134),data1!AO134,\"\")","v":""},null,null,{"$f":"IF(ISNUMBER(data1!AN134),data1!AR134,\"\")","v":""},null,{"$f":"IF(ISNUMBER(data1!AN134),data1!AT134,\"\")","v":""},null,null,null,{"$f":"IF(ISNUMBER(data1!AN134),data1!AX134,\"\")","v":""}]
[{"$f":"IF(ISNUMBER(data1!AN135),data1!AA135,\"\")","v":""},{"$f":"IF(ISNUMBER(data1!AN135),data1!AB135,\"\")","v":""},null,null,{"$f":"IF(ISNUMBER(data1!AN135),data1!AE135,\"\")","v":""},{"$f":"IF(ISNUMBER(data1!AN135),data1!AF135,\"\")","v":""},{"$f":"IF(ISNUMBER(data1!AN135),data1!AG135,\"\")","v":""},null,null,null,null,null,null,{"$f":"IF(ISNUMBER(data1!AN135),data1!AN135,\"\")","v":""},{"$f":"IF(ISNUMBER(data1!AN135),data1!AO135,\"\")","v":""},null,null,{"$f":"IF(ISNUMBER(data1!AN135),data1!AR135,\"\")","v":""},null,{"$f":"IF(ISNUMBER(data1!AN135),data1!AT135,\"\")","v":""},null,null,null,{"$f":"IF(ISNUMBER(data1!AN135),data1!AX135,\"\")","v":""}]
[{"$f":"IF(ISNUMBER(data1!AN136),data1!AA136,\"\")","v":""},{"$f":"IF(ISNUMBER(data1!AN136),data1!AB136,\"\")","v":""},null,null,{"$f":"IF(ISNUMBER(data1!AN136),data1!AE136,\"\")","v":""},{"$f":"IF(ISNUMBER(data1!AN136),data1!AF136,\"\")","v":""},{"$f":"IF(ISNUMBER(data1!AN136),data1!AG136,\"\")","v":""},null,null,null,null,null,null,{"$f":"IF(ISNUMBER(data1!AN136),data1!AN136,\"\")","v":""},{"$f":"IF(ISNUMBER(data1!AN136),data1!AO136,\"\")","v":""},null,null,{"$f":"IF(ISNUMBER(data1!AN136),data1!AR136,\"\")","v":""},null,{"$f":"IF(ISNUMBER(data1!AN136),data1!AT136,\"\")","v":""},null,null,null,{"$f":"IF(ISNUMBER(data1!AN136),data1!AX136,\"\")","v":""}]
[{"$f":"IF(ISNUMBER(data1!AN137),data1!AA137,\"\")","v":""},{"$f":"IF(ISNUMBER(data1!AN137),data1!AB137,\"\")","v":""},null,null,{"$f":"IF(ISNUMBER(data1!AN137),data1!AE137,\"\")","v":""},{"$f":"IF(ISNUMBER(data1!AN137),data1!AF137,\"\")","v":""},{"$f":"IF(ISNUMBER(data1!AN137),data1!AG137,\"\")","v":""},null,null,null,null,null,null,{"$f":"IF(ISNUMBER(data1!AN137),data1!AN137,\"\")","v":""},{"$f":"IF(ISNUMBER(data1!AN137),data1!AO137,\"\")","v":""},null,null,{"$f":"IF(ISNUMBER(data1!AN137),data1!AR137,\"\")","v":""},null,{"$f":"IF(ISNUMBER(data1!AN137),data1!AT137,\"\")","v":""},null,null,null,{"$f":"IF(ISNUMBER(data1!AN137),data1!AX137,\"\")","v":""}]
[{"$f":"IF(ISNUMBER(data1!AN138),data1!AA138,\"\")","v":""},{"$f":"IF(ISNUMBER(data1!AN138),data1!AB138,\"\")","v":""},null,null,{"$f":"IF(ISNUMBER(data1!AN138),data1!AE138,\"\")","v":""},{"$f":"IF(ISNUMBER(data1!AN138),data1!AF138,\"\")","v":""},{"$f":"IF(ISNUMBER(data1!AN138),data1!AG138,\"\")","v":""},null,null,null,null,null,null,{"$f":"IF(ISNUMBER(data1!AN138),data1!AN138,\"\")","v":""},{"$f":"IF(ISNUMBER(data1!AN138),data1!AO138,\"\")","v":""},null,null,{"$f":"IF(ISNUMBER(data1!AN138),data1!AR138,\"\")","v":""},null,{"$f":"IF(ISNUMBER(data1!AN138),data1!AT138,\"\")","v":""},null,null,null,{"$f":"IF(ISNUMBER(data1!AN138),data1!AX138,\"\")","v":""}]
[{"$f":"IF(ISNUMBER(data1!AN139),data1!AA139,\"\")","v":""},{"$f":"IF(ISNUMBER(data1!AN139),data1!AB139,\"\")","v":""},null,null,{"$f":"IF(ISNUMBER(data1!AN139),data1!AE139,\"\")","v":""},{"$f":"IF(ISNUMBER(data1!AN139),data1!AF139,\"\")","v":""},{"$f":"IF(ISNUMBER(data1!AN139),data1!AG139,\"\")","v":""},null,null,null,null,null,null,{"$f":"IF(ISNUMBER(data1!AN139),data1!AN139,\"\")","v":""},{"$f":"IF(ISNUMBER(data1!AN139),data1!AO139,\"\")","v":""},null,null,{"$f":"IF(ISNUMBER(data1!AN139),data1!AR139,\"\")","v":""},null,{"$f":"IF(ISNUMBER(data1!AN139),data1!AT139,\"\")","v":""},null,null,null,{"$f":"IF(ISNUMBER(data1!AN139),data1!AX139,\"\")","v":""}]
[{"$f":"IF(ISNUMBER(data1!AN140),data1!AA140,\"\")","v":""},{"$f":"IF(ISNUMBER(data1!AN140),data1!AB140,\"\")","v":""},null,null,{"$f":"IF(ISNUMBER(data1!AN140),data1!AE140,\"\")","v":""},{"$f":"IF(ISNUMBER(data1!AN140),data1!AF140,\"\")","v":""},{"$f":"IF(ISNUMBER(data1!AN140),data1!AG140,\"\")","v":""},null,null,null,null,null,null,{"$f":"IF(ISNUMBER(data1!AN140),data1!AN140,\"\")","v":""},{"$f":"IF(ISNUMBER(data1!AN140),data1!AO140,\"\")","v":""},null,null,{"$f":"IF(ISNUMBER(data1!AN140),data1!AR140,\"\")","v":""},null,{"$f":"IF(ISNUMBER(data1!AN140),data1!AT140,\"\")","v":""},null,null,null,{"$f":"IF(ISNUMBER(data1!AN140),data1!AX140,\"\")","v":""}]
[{"$f":"IF(ISNUMBER(data1!AN141),data1!AA141,\"\")","v":""},{"$f":"IF(ISNUMBER(data1!AN141),data1!AB141,\"\")","v":""},null,null,{"$f":"IF(ISNUMBER(data1!AN141),data1!AE141,\"\")","v":""},{"$f":"IF(ISNUMBER(data1!AN141),data1!AF141,\"\")","v":""},{"$f":"IF(ISNUMBER(data1!AN141),data1!AG141,\"\")","v":""},null,null,null,null,null,null,{"$f":"IF(ISNUMBER(data1!AN141),data1!AN141,\"\")","v":""},{"$f":"IF(ISNUMBER(data1!AN141),data1!AO141,\"\")","v":""},null,null,{"$f":"IF(ISNUMBER(data1!AN141),data1!AR141,\"\")","v":""},null,{"$f":"IF(ISNUMBER(data1!AN141),data1!AT141,\"\")","v":""},null,null,null,{"$f":"IF(ISNUMBER(data1!AN141),data1!AX141,\"\")","v":""}]
[{"$f":"IF(ISNUMBER(data1!AN142),data1!AA142,\"\")","v":""},{"$f":"IF(ISNUMBER(data1!AN142),data1!AB142,\"\")","v":""},null,null,{"$f":"IF(ISNUMBER(data1!AN142),data1!AE142,\"\")","v":""},{"$f":"IF(ISNUMBER(data1!AN142),data1!AF142,\"\")","v":""},{"$f":"IF(ISNUMBER(data1!AN142),data1!AG142,\"\")","v":""},null,null,null,null,null,null,{"$f":"IF(ISNUMBER(data1!AN142),data1!AN142,\"\")","v":""},{"$f":"IF(ISNUMBER(data1!AN142),data1!AO142,\"\")","v":""},null,null,{"$f":"IF(ISNUMBER(data1!AN142),data1!AR142,\"\")","v":""},null,{"$f":"IF(ISNUMBER(data1!AN142),data1!AT142,\"\")","v":""},null,null,null,{"$f":"IF(ISNUMBER(data1!AN142),data1!AX142,\"\")","v":""}]
[{"$f":"IF(ISNUMBER(data1!AN143),data1!AA143,\"\")","v":""},{"$f":"IF(ISNUMBER(data1!AN143),data1!AB143,\"\")","v":""},null,null,{"$f":"IF(ISNUMBER(data1!AN143),data1!AE143,\"\")","v":""},{"$f":"IF(ISNUMBER(data1!AN143),data1!AF143,\"\")","v":""},{"$f":"IF(ISNUMBER(data1!AN143),data1!AG143,\"\")","v":""},null,null,null,null,null,null,{"$f":"IF(ISNUMBER(data1!AN143),data1!AN143,\"\")","v":""},{"$f":"IF(ISNUMBER(data1!AN143),data1!AO143,\"\")","v":""},null,null,{"$f":"IF(ISNUMBER(data1!AN143),data1!AR143,\"\")","v":""},null,{"$f":"IF(ISNUMBER(data1!AN143),data1!AT143,\"\")","v":""},null,null,null,{"$f":"IF(ISNUMBER(data1!AN143),data1!AX143,\"\")","v":""}]
[{"$f":"IF(ISNUMBER(data1!AN144),data1!AA144,\"\")","v":""},{"$f":"IF(ISNUMBER(data1!AN144),data1!AB144,\"\")","v":""},null,null,{"$f":"IF(ISNUMBER(data1!AN144),data1!AE144,\"\")","v":""},{"$f":"IF(ISNUMBER(data1!AN144),data1!AF144,\"\")","v":""},{"$f":"IF(ISNUMBER(data1!AN144),data1!AG144,\"\")","v":""},null,null,null,null,null,null,{"$f":"IF(ISNUMBER(data1!AN144),data1!AN144,\"\")","v":""},{"$f":"IF(ISNUMBER(data1!AN144),data1!AO144,\"\")","v":""},null,null,{"$f":"IF(ISNUMBER(data1!AN144),data1!AR144,\"\")","v":""},null,{"$f":"IF(ISNUMBER(data1!AN144),data1!AT144,\"\")","v":""},null,null,null,{"$f":"IF(ISNUMBER(data1!AN144),data1!AX144,\"\")","v":""}]
[{"$f":"IF(ISNUMBER(data1!AN145),data1!AA145,\"\")","v":""},{"$f":"IF(ISNUMBER(data1!AN145),data1!AB145,\"\")","v":""},null,null,{"$f":"IF(ISNUMBER(data1!AN145),data1!AE145,\"\")","v":""},{"$f":"IF(ISNUMBER(data1!AN145),data1!AF145,\"\")","v":""},{"$f":"IF(ISNUMBER(data1!AN145),data1!AG145,\"\")","v":""},null,null,null,null,null,null,{"$f":"IF(ISNUMBER(data1!AN145),data1!AN145,\"\")","v":""},{"$f":"IF(ISNUMBER(data1!AN145),data1!AO145,\"\")","v":""},null,null,{"$f":"IF(ISNUMBER(data1!AN145),data1!AR145,\"\")","v":""},null,{"$f":"IF(ISNUMBER(data1!AN145),data1!AT145,\"\")","v":""},null,null,null,{"$f":"IF(ISNUMBER(data1!AN145),data1!AX145,\"\")","v":""}]
[{"$f":"IF(ISNUMBER(data1!AN146),data1!AA146,\"\")","v":""},{"$f":"IF(ISNUMBER(data1!AN146),data1!AB146,\"\")","v":""},null,null,{"$f":"IF(ISNUMBER(data1!AN146),data1!AE146,\"\")","v":""},{"$f":"IF(ISNUMBER(data1!AN146),data1!AF146,\"\")","v":""},{"$f":"IF(ISNUMBER(data1!AN146),data1!AG146,\"\")","v":""},null,null,null,null,null,null,{"$f":"IF(ISNUMBER(data1!AN146),data1!AN146,\"\")","v":""},{"$f":"IF(ISNUMBER(data1!AN146),data1!AO146,\"\")","v":""},null,null,{"$f":"IF(ISNUMBER(data1!AN146),data1!AR146,\"\")","v":""},null,{"$f":"IF(ISNUMBER(data1!AN146),data1!AT146,\"\")","v":""},null,null,null,{"$f":"IF(ISNUMBER(data1!AN146),data1!AX146,\"\")","v":""}]
[{"$f":"IF(ISNUMBER(data1!AN147),data1!AA147,\"\")","v":""},{"$f":"IF(ISNUMBER(data1!AN147),data1!AB147,\"\")","v":""},null,null,{"$f":"IF(ISNUMBER(data1!AN147),data1!AE147,\"\")","v":""},{"$f":"IF(ISNUMBER(data1!AN147),data1!AF147,\"\")","v":""},{"$f":"IF(ISNUMBER(data1!AN147),data1!AG147,\"\")","v":""},null,null,null,null,null,null,{"$f":"IF(ISNUMBER(data1!AN147),data1!AN147,\"\")","v":""},{"$f":"IF(ISNUMBER(data1!AN147),data1!AO147,\"\")","v":""},null,null,{"$f":"IF(ISNUMBER(data1!AN147),data1!AR147,\"\")","v":""},null,{"$f":"IF(ISNUMBER(data1!AN147),data1!AT147,\"\")","v":""},null,null,null,{"$f":"IF(ISNUMBER(data1!AN147),data1!AX147,\"\")","v":""}]
[{"$f":"IF(ISNUMBER(data1!AN148),data1!AA148,\"\")","v":""},{"$f":"IF(ISNUMBER(data1!AN148),data1!AB148,\"\")","v":""},null,null,{"$f":"IF(ISNUMBER(data1!AN148),data1!AE148,\"\")","v":""},{"$f":"IF(ISNUMBER(data1!AN148),data1!AF148,\"\")","v":""},{"$f":"IF(ISNUMBER(data1!AN148),data1!AG148,\"\")","v":""},null,null,null,null,null,null,{"$f":"IF(ISNUMBER(data1!AN148),data1!AN148,\"\")","v":""},{"$f":"IF(ISNUMBER(data1!AN148),data1!AO148,\"\")","v":""},null,null,{"$f":"IF(ISNUMBER(data1!AN148),data1!AR148,\"\")","v":""},null,{"$f":"IF(ISNUMBER(data1!AN148),data1!AT148,\"\")","v":""},null,null,null,{"$f":"IF(ISNUMBER(data1!AN148),data1!AX148,\"\")","v":""}]
[{"$f":"IF(ISNUMBER(data1!AN149),data1!AA149,\"\")","v":""},{"$f":"IF(ISNUMBER(data1!AN149),data1!AB149,\"\")","v":""},null,null,{"$f":"IF(ISNUMBER(data1!AN149),data1!AE149,\"\")","v":""},{"$f":"IF(ISNUMBER(data1!AN149),data1!AF149,\"\")","v":""},{"$f":"IF(ISNUMBER(data1!AN149),data1!AG149,\"\")","v":""},null,null,null,null,null,null,{"$f":"IF(ISNUMBER(data1!AN149),data1!AN149,\"\")","v":""},{"$f":"IF(ISNUMBER(data1!AN149),data1!AO149,\"\")","v":""},null,null,{"$f":"IF(ISNUMBER(data1!AN149),data1!AR149,\"\")","v":""},null,{"$f":"IF(ISNUMBER(data1!AN149),data1!AT149,\"\")","v":""},null,null,null,{"$f":"IF(ISNUMBER(data1!AN149),data1!AX149,\"\")","v":""}]
[{"$f":"IF(ISNUMBER(data1!AN150),data1!AA150,\"\")","v":""},{"$f":"IF(ISNUMBER(data1!AN150),data1!AB150,\"\")","v":""},null,null,{"$f":"IF(ISNUMBER(data1!AN150),data1!AE150,\"\")","v":""},{"$f":"IF(ISNUMBER(data1!AN150),data1!AF150,\"\")","v":""},{"$f":"IF(ISNUMBER(data1!AN150),data1!AG150,\"\")","v":""},null,null,null,null,null,null,{"$f":"IF(ISNUMBER(data1!AN150),data1!AN150,\"\")","v":""},{"$f":"IF(ISNUMBER(data1!AN150),data1!AO150,\"\")","v":""},null,null,{"$f":"IF(ISNUMBER(data1!AN150),data1!AR150,\"\")","v":""},null,{"$f":"IF(ISNUMBER(data1!AN150),data1!AT150,\"\")","v":""},null,null,null,{"$f":"IF(ISNUMBER(data1!AN150),data1!AX150,\"\")","v":""}]
[{"$f":"IF(ISNUMBER(data1!AN151),data1!AA151,\"\")","v":""},{"$f":"IF(ISNUMBER(data1!AN151),data1!AB151,\"\")","v":""},null,null,{"$f":"IF(ISNUMBER(data1!AN151),data1!AE151,\"\")","v":""},{"$f":"IF(ISNUMBER(data1!AN151),data1!AF151,\"\")","v":""},{"$f":"IF(ISNUMBER(data1!AN151),data1!AG151,\"\")","v":""},null,null,null,null,null,null,{"$f":"IF(ISNUMBER(data1!AN151),data1!AN151,\"\")","v":""},{"$f":"IF(ISNUMBER(data1!AN151),data1!AO151,\"\")","v":""},null,null,{"$f":"IF(ISNUMBER(data1!AN151),data1!AR151,\"\")","v":""},null,{"$f":"IF(ISNUMBER(data1!AN151),data1!AT151,\"\")","v":""},null,null,null,{"$f":"IF(ISNUMBER(data1!AN151),data1!AX151,\"\")","v":""}]
[{"$f":"IF(ISNUMBER(data1!AN152),data1!AA152,\"\")","v":""},{"$f":"IF(ISNUMBER(data1!AN152),data1!AB152,\"\")","v":""},null,null,{"$f":"IF(ISNUMBER(data1!AN152),data1!AE152,\"\")","v":""},{"$f":"IF(ISNUMBER(data1!AN152),data1!AF152,\"\")","v":""},{"$f":"IF(ISNUMBER(data1!AN152),data1!AG152,\"\")","v":""},null,null,null,null,null,null,{"$f":"IF(ISNUMBER(data1!AN152),data1!AN152,\"\")","v":""},{"$f":"IF(ISNUMBER(data1!AN152),data1!AO152,\"\")","v":""},null,null,{"$f":"IF(ISNUMBER(data1!AN152),data1!AR152,\"\")","v":""},null,{"$f":"IF(ISNUMBER(data1!AN152),data1!AT152,\"\")","v":""},null,null,null,{"$f":"IF(ISNUMBER(data1!AN152),data1!AX152,\"\")","v":""}]
[{"$f":"IF(ISNUMBER(data1!AN153),data1!AA153,\"\")","v":""},{"$f":"IF(ISNUMBER(data1!AN153),data1!AB153,\"\")","v":""},null,null,{"$f":"IF(ISNUMBER(data1!AN153),data1!AE153,\"\")","v":""},{"$f":"IF(ISNUMBER(data1!AN153),data1!AF153,\"\")","v":""},{"$f":"IF(ISNUMBER(data1!AN153),data1!AG153,\"\")","v":""},null,null,null,null,null,null,{"$f":"IF(ISNUMBER(data1!AN153),data1!AN153,\"\")","v":""},{"$f":"IF(ISNUMBER(data1!AN153),data1!AO153,\"\")","v":""},null,null,{"$f":"IF(ISNUMBER(data1!AN153),data1!AR153,\"\")","v":""},null,{"$f":"IF(ISNUMBER(data1!AN153),data1!AT153,\"\")","v":""},null,null,null,{"$f":"IF(ISNUMBER(data1!AN153),data1!AX153,\"\")","v":""}]
[{"$f":"IF(ISNUMBER(data1!AN154),data1!AA154,\"\")","v":""},{"$f":"IF(ISNUMBER(data1!AN154),data1!AB154,\"\")","v":""},null,null,{"$f":"IF(ISNUMBER(data1!AN154),data1!AE154,\"\")","v":""},{"$f":"IF(ISNUMBER(data1!AN154),data1!AF154,\"\")","v":""},{"$f":"IF(ISNUMBER(data1!AN154),data1!AG154,\"\")","v":""},null,null,null,null,null,null,{"$f":"IF(ISNUMBER(data1!AN154),data1!AN154,\"\")","v":""},{"$f":"IF(ISNUMBER(data1!AN154),data1!AO154,\"\")","v":""},null,null,{"$f":"IF(ISNUMBER(data1!AN154),data1!AR154,\"\")","v":""},null,{"$f":"IF(ISNUMBER(data1!AN154),data1!AT154,\"\")","v":""},null,null,null,{"$f":"IF(ISNUMBER(data1!AN154),data1!AX154,\"\")","v":""}]
[{"$f":"IF(ISNUMBER(data1!AN155),data1!AA155,\"\")","v":""},{"$f":"IF(ISNUMBER(data1!AN155),data1!AB155,\"\")","v":""},null,null,{"$f":"IF(ISNUMBER(data1!AN155),data1!AE155,\"\")","v":""},{"$f":"IF(ISNUMBER(data1!AN155),data1!AF155,\"\")","v":""},{"$f":"IF(ISNUMBER(data1!AN155),data1!AG155,\"\")","v":""},null,null,null,null,null,null,{"$f":"IF(ISNUMBER(data1!AN155),data1!AN155,\"\")","v":""},{"$f":"IF(ISNUMBER(data1!AN155),data1!AO155,\"\")","v":""},null,null,{"$f":"IF(ISNUMBER(data1!AN155),data1!AR155,\"\")","v":""},null,{"$f":"IF(ISNUMBER(data1!AN155),data1!AT155,\"\")","v":""},null,null,null,{"$f":"IF(ISNUMBER(data1!AN155),data1!AX155,\"\")","v":""}]
[{"$f":"IF(ISNUMBER(data1!AN156),data1!AA156,\"\")","v":""},{"$f":"IF(ISNUMBER(data1!AN156),data1!AB156,\"\")","v":""},null,null,{"$f":"IF(ISNUMBER(data1!AN156),data1!AE156,\"\")","v":""},{"$f":"IF(ISNUMBER(data1!AN156),data1!AF156,\"\")","v":""},{"$f":"IF(ISNUMBER(data1!AN156),data1!AG156,\"\")","v":""},null,null,null,null,null,null,{"$f":"IF(ISNUMBER(data1!AN156),data1!AN156,\"\")","v":""},{"$f":"IF(ISNUMBER(data1!AN156),data1!AO156,\"\")","v":""},null,null,{"$f":"IF(ISNUMBER(data1!AN156),data1!AR156,\"\")","v":""},null,{"$f":"IF(ISNUMBER(data1!AN156),data1!AT156,\"\")","v":""},null,null,null,{"$f":"IF(ISNUMBER(data1!AN156),data1!AX156,\"\")","v":""}]
[{"$f":"IF(ISNUMBER(data1!AN157),data1!AA157,\"\")","v":""},{"$f":"IF(ISNUMBER(data1!AN157),data1!AB157,\"\")","v":""},null,null,{"$f":"IF(ISNUMBER(data1!AN157),data1!AE157,\"\")","v":""},{"$f":"IF(ISNUMBER(data1!AN157),data1!AF157,\"\")","v":""},{"$f":"IF(ISNUMBER(data1!AN157),data1!AG157,\"\")","v":""},null,null,null,null,null,null,{"$f":"IF(ISNUMBER(data1!AN157),data1!AN157,\"\")","v":""},{"$f":"IF(ISNUMBER(data1!AN157),data1!AO157,\"\")","v":""},null,null,{"$f":"IF(ISNUMBER(data1!AN157),data1!AR157,\"\")","v":""},null,{"$f":"IF(ISNUMBER(data1!AN157),data1!AT157,\"\")","v":""},null,null,null,{"$f":"IF(ISNUMBER(data1!AN157),data1!AX157,\"\")","v":""}]
[{"$f":"IF(ISNUMBER(data1!AN158),data1!AA158,\"\")","v":""},{"$f":"IF(ISNUMBER(data1!AN158),data1!AB158,\"\")","v":""},null,null,{"$f":"IF(ISNUMBER(data1!AN158),data1!AE158,\"\")","v":""},{"$f":"IF(ISNUMBER(data1!AN158),data1!AF158,\"\")","v":""},{"$f":"IF(ISNUMBER(data1!AN158),data1!AG158,\"\")","v":""},null,null,null,null,null,null,{"$f":"IF(ISNUMBER(data1!AN158),data1!AN158,\"\")","v":""},{"$f":"IF(ISNUMBER(data1!AN158),data1!AO158,\"\")","v":""},null,null,{"$f":"IF(ISNUMBER(data1!AN158),data1!AR158,\"\")","v":""},null,{"$f":"IF(ISNUMBER(data1!AN158),data1!AT158,\"\")","v":""},null,null,null,{"$f":"IF(ISNUMBER(data1!AN158),data1!AX158,\"\")","v":""}]
[{"$f":"IF(ISNUMBER(data1!AN159),data1!AA159,\"\")","v":""},{"$f":"IF(ISNUMBER(data1!AN159),data1!AB159,\"\")","v":""},null,null,{"$f":"IF(ISNUMBER(data1!AN159),data1!AE159,\"\")","v":""},{"$f":"IF(ISNUMBER(data1!AN159),data1!AF159,\"\")","v":""},{"$f":"IF(ISNUMBER(data1!AN159),data1!AG159,\"\")","v":""},null,null,null,null,null,null,{"$f":"IF(ISNUMBER(data1!AN159),data1!AN159,\"\")","v":""},{"$f":"IF(ISNUMBER(data1!AN159),data1!AO159,\"\")","v":""},null,null,{"$f":"IF(ISNUMBER(data1!AN159),data1!AR159,\"\")","v":""},null,{"$f":"IF(ISNUMBER(data1!AN159),data1!AT159,\"\")","v":""},null,null,null,{"$f":"IF(ISNUMBER(data1!AN159),data1!AX159,\"\")","v":""}]
[{"$f":"IF(ISNUMBER(data1!AN160),data1!AA160,\"\")","v":""},{"$f":"IF(ISNUMBER(data1!AN160),data1!AB160,\"\")","v":""},null,null,{"$f":"IF(ISNUMBER(data1!AN160),data1!AE160,\"\")","v":""},{"$f":"IF(ISNUMBER(data1!AN160),data1!AF160,\"\")","v":""},{"$f":"IF(ISNUMBER(data1!AN160),data1!AG160,\"\")","v":""},null,null,null,null,null,null,{"$f":"IF(ISNUMBER(data1!AN160),data1!AN160,\"\")","v":""},{"$f":"IF(ISNUMBER(data1!AN160),data1!AO160,\"\")","v":""},null,null,{"$f":"IF(ISNUMBER(data1!AN160),data1!AR160,\"\")","v":""},null,{"$f":"IF(ISNUMBER(data1!AN160),data1!AT160,\"\")","v":""},null,null,null,{"$f":"IF(ISNUMBER(data1!AN160),data1!AX160,\"\")","v":""}]
[{"$f":"IF(ISNUMBER(data1!AN161),data1!AA161,\"\")","v":""},{"$f":"IF(ISNUMBER(data1!AN161),data1!AB161,\"\")","v":""},null,null,{"$f":"IF(ISNUMBER(data1!AN161),data1!AE161,\"\")","v":""},{"$f":"IF(ISNUMBER(data1!AN161),data1!AF161,\"\")","v":""},{"$f":"IF(ISNUMBER(data1!AN161),data1!AG161,\"\")","v":""},null,null,null,null,null,null,{"$f":"IF(ISNUMBER(data1!AN161),data1!AN161,\"\")","v":""},{"$f":"IF(ISNUMBER(data1!AN161),data1!AO161,\"\")","v":""},null,null,{"$f":"IF(ISNUMBER(data1!AN161),data1!AR161,\"\")","v":""},null,{"$f":"IF(ISNUMBER(data1!AN161),data1!AT161,\"\")","v":""},null,null,null,{"$f":"IF(ISNUMBER(data1!AN161),data1!AX161,\"\")","v":""}]
[{"$f":"IF(ISNUMBER(data1!AN162),data1!AA162,\"\")","v":""},{"$f":"IF(ISNUMBER(data1!AN162),data1!AB162,\"\")","v":""},null,null,{"$f":"IF(ISNUMBER(data1!AN162),data1!AE162,\"\")","v":""},{"$f":"IF(ISNUMBER(data1!AN162),data1!AF162,\"\")","v":""},{"$f":"IF(ISNUMBER(data1!AN162),data1!AG162,\"\")","v":""},null,null,null,null,null,null,{"$f":"IF(ISNUMBER(data1!AN162),data1!AN162,\"\")","v":""},{"$f":"IF(ISNUMBER(data1!AN162),data1!AO162,\"\")","v":""},null,null,{"$f":"IF(ISNUMBER(data1!AN162),data1!AR162,\"\")","v":""},null,{"$f":"IF(ISNUMBER(data1!AN162),data1!AT162,\"\")","v":""},null,null,null,{"$f":"IF(ISNUMBER(data1!AN162),data1!AX162,\"\")","v":""}]
[{"$f":"IF(ISNUMBER(data1!AN163),data1!AA163,\"\")","v":""},{"$f":"IF(ISNUMBER(data1!AN163),data1!AB163,\"\")","v":""},null,null,{"$f":"IF(ISNUMBER(data1!AN163),data1!AE163,\"\")","v":""},{"$f":"IF(ISNUMBER(data1!AN163),data1!AF163,\"\")","v":""},{"$f":"IF(ISNUMBER(data1!AN163),data1!AG163,\"\")","v":""},null,null,null,null,null,null,{"$f":"IF(ISNUMBER(data1!AN163),data1!AN163,\"\")","v":""},{"$f":"IF(ISNUMBER(data1!AN163),data1!AO163,\"\")","v":""},null,null,{"$f":"IF(ISNUMBER(data1!AN163),data1!AR163,\"\")","v":""},null,{"$f":"IF(ISNUMBER(data1!AN163),data1!AT163,\"\")","v":""},null,null,null,{"$f":"IF(ISNUMBER(data1!AN163),data1!AX163,\"\")","v":""}]
[{"$f":"IF(ISNUMBER(data1!AN164),data1!AA164,\"\")","v":""},{"$f":"IF(ISNUMBER(data1!AN164),data1!AB164,\"\")","v":""},null,null,{"$f":"IF(ISNUMBER(data1!AN164),data1!AE164,\"\")","v":""},{"$f":"IF(ISNUMBER(data1!AN164),data1!AF164,\"\")","v":""},{"$f":"IF(ISNUMBER(data1!AN164),data1!AG164,\"\")","v":""},null,null,null,null,null,null,{"$f":"IF(ISNUMBER(data1!AN164),data1!AN164,\"\")","v":""},{"$f":"IF(ISNUMBER(data1!AN164),data1!AO164,\"\")","v":""},null,null,{"$f":"IF(ISNUMBER(data1!AN164),data1!AR164,\"\")","v":""},null,{"$f":"IF(ISNUMBER(data1!AN164),data1!AT164,\"\")","v":""},null,null,null,{"$f":"IF(ISNUMBER(data1!AN164),data1!AX164,\"\")","v":""}]
[{"$f":"IF(ISNUMBER(data1!AN165),data1!AA165,\"\")","v":""},{"$f":"IF(ISNUMBER(data1!AN165),data1!AB165,\"\")","v":""},null,null,{"$f":"IF(ISNUMBER(data1!AN165),data1!AE165,\"\")","v":""},{"$f":"IF(ISNUMBER(data1!AN165),data1!AF165,\"\")","v":""},{"$f":"IF(ISNUMBER(data1!AN165),data1!AG165,\"\")","v":""},null,null,null,null,null,null,{"$f":"IF(ISNUMBER(data1!AN165),data1!AN165,\"\")","v":""},{"$f":"IF(ISNUMBER(data1!AN165),data1!AO165,\"\")","v":""},null,null,{"$f":"IF(ISNUMBER(data1!AN165),data1!AR165,\"\")","v":""},null,{"$f":"IF(ISNUMBER(data1!AN165),data1!AT165,\"\")","v":""},null,null,null,{"$f":"IF(ISNUMBER(data1!AN165),data1!AX165,\"\")","v":""}]
[{"$f":"IF(ISNUMBER(data1!AN166),data1!AA166,\"\")","v":""},{"$f":"IF(ISNUMBER(data1!AN166),data1!AB166,\"\")","v":""},null,null,{"$f":"IF(ISNUMBER(data1!AN166),data1!AE166,\"\")","v":""},{"$f":"IF(ISNUMBER(data1!AN166),data1!AF166,\"\")","v":""},{"$f":"IF(ISNUMBER(data1!AN166),data1!AG166,\"\")","v":""},null,null,null,null,null,null,{"$f":"IF(ISNUMBER(data1!AN166),data1!AN166,\"\")","v":""},{"$f":"IF(ISNUMBER(data1!AN166),data1!AO166,\"\")","v":""},null,null,{"$f":"IF(ISNUMBER(data1!AN166),data1!AR166,\"\")","v":""},null,{"$f":"IF(ISNUMBER(data1!AN166),data1!AT166,\"\")","v":""},null,null,null,{"$f":"IF(ISNUMBER(data1!AN166),data1!AX166,\"\")","v":""}]
[{"$f":"IF(ISNUMBER(data1!AN167),data1!AA167,\"\")","v":""},{"$f":"IF(ISNUMBER(data1!AN167),data1!AB167,\"\")","v":""},null,null,{"$f":"IF(ISNUMBER(data1!AN167),data1!AE167,\"\")","v":""},{"$f":"IF(ISNUMBER(data1!AN167),data1!AF167,\"\")","v":""},{"$f":"IF(ISNUMBER(data1!AN167),data1!AG167,\"\")","v":""},null,null,null,null,null,null,{"$f":"IF(ISNUMBER(data1!AN167),data1!AN167,\"\")","v":""},{"$f":"IF(ISNUMBER(data1!AN167),data1!AO167,\"\")","v":""},null,null,{"$f":"IF(ISNUMBER(data1!AN167),data1!AR167,\"\")","v":""},null,{"$f":"IF(ISNUMBER(data1!AN167),data1!AT167,\"\")","v":""},null,null,null,{"$f":"IF(ISNUMBER(data1!AN167),data1!AX167,\"\")","v":""}]
[{"$f":"IF(ISNUMBER(data1!AN168),data1!AA168,\"\")","v":""},{"$f":"IF(ISNUMBER(data1!AN168),data1!AB168,\"\")","v":""},null,null,{"$f":"IF(ISNUMBER(data1!AN168),data1!AE168,\"\")","v":""},{"$f":"IF(ISNUMBER(data1!AN168),data1!AF168,\"\")","v":""},{"$f":"IF(ISNUMBER(data1!AN168),data1!AG168,\"\")","v":""},null,null,null,null,null,null,{"$f":"IF(ISNUMBER(data1!AN168),data1!AN168,\"\")","v":""},{"$f":"IF(ISNUMBER(data1!AN168),data1!AO168,\"\")","v":""},null,null,{"$f":"IF(ISNUMBER(data1!AN168),data1!AR168,\"\")","v":""},null,{"$f":"IF(ISNUMBER(data1!AN168),data1!AT168,\"\")","v":""},null,null,null,{"$f":"IF(ISNUMBER(data1!AN168),data1!AX168,\"\")","v":""}]
[{"$f":"IF(ISNUMBER(data1!AN169),data1!AA169,\"\")","v":""},{"$f":"IF(ISNUMBER(data1!AN169),data1!AB169,\"\")","v":""},null,null,{"$f":"IF(ISNUMBER(data1!AN169),data1!AE169,\"\")","v":""},{"$f":"IF(ISNUMBER(data1!AN169),data1!AF169,\"\")","v":""},{"$f":"IF(ISNUMBER(data1!AN169),data1!AG169,\"\")","v":""},null,null,null,null,null,null,{"$f":"IF(ISNUMBER(data1!AN169),data1!AN169,\"\")","v":""},{"$f":"IF(ISNUMBER(data1!AN169),data1!AO169,\"\")","v":""},null,null,{"$f":"IF(ISNUMBER(data1!AN169),data1!AR169,\"\")","v":""},null,{"$f":"IF(ISNUMBER(data1!AN169),data1!AT169,\"\")","v":""},null,null,null,{"$f":"IF(ISNUMBER(data1!AN169),data1!AX169,\"\")","v":""}]
[{"$f":"IF(ISNUMBER(data1!AN170),data1!AA170,\"\")","v":""},{"$f":"IF(ISNUMBER(data1!AN170),data1!AB170,\"\")","v":""},null,null,{"$f":"IF(ISNUMBER(data1!AN170),data1!AE170,\"\")","v":""},{"$f":"IF(ISNUMBER(data1!AN170),data1!AF170,\"\")","v":""},{"$f":"IF(ISNUMBER(data1!AN170),data1!AG170,\"\")","v":""},null,null,null,null,null,null,{"$f":"IF(ISNUMBER(data1!AN170),data1!AN170,\"\")","v":""},{"$f":"IF(ISNUMBER(data1!AN170),data1!AO170,\"\")","v":""},null,null,{"$f":"IF(ISNUMBER(data1!AN170),data1!AR170,\"\")","v":""},null,{"$f":"IF(ISNUMBER(data1!AN170),data1!AT170,\"\")","v":""},null,null,null,{"$f":"IF(ISNUMBER(data1!AN170),data1!AX170,\"\")","v":""}]
[{"$f":"IF(ISNUMBER(data1!AN171),data1!AA171,\"\")","v":""},{"$f":"IF(ISNUMBER(data1!AN171),data1!AB171,\"\")","v":""},null,null,{"$f":"IF(ISNUMBER(data1!AN171),data1!AE171,\"\")","v":""},{"$f":"IF(ISNUMBER(data1!AN171),data1!AF171,\"\")","v":""},{"$f":"IF(ISNUMBER(data1!AN171),data1!AG171,\"\")","v":""},null,null,null,null,null,null,{"$f":"IF(ISNUMBER(data1!AN171),data1!AN171,\"\")","v":""},{"$f":"IF(ISNUMBER(data1!AN171),data1!AO171,\"\")","v":""},null,null,{"$f":"IF(ISNUMBER(data1!AN171),data1!AR171,\"\")","v":""},null,{"$f":"IF(ISNUMBER(data1!AN171),data1!AT171,\"\")","v":""},null,null,null,{"$f":"IF(ISNUMBER(data1!AN171),data1!AX171,\"\")","v":""}]
[{"$f":"IF(ISNUMBER(data1!AN172),data1!AA172,\"\")","v":""},{"$f":"IF(ISNUMBER(data1!AN172),data1!AB172,\"\")","v":""},null,null,{"$f":"IF(ISNUMBER(data1!AN172),data1!AE172,\"\")","v":""},{"$f":"IF(ISNUMBER(data1!AN172),data1!AF172,\"\")","v":""},{"$f":"IF(ISNUMBER(data1!AN172),data1!AG172,\"\")","v":""},null,null,null,null,null,null,{"$f":"IF(ISNUMBER(data1!AN172),data1!AN172,\"\")","v":""},{"$f":"IF(ISNUMBER(data1!AN172),data1!AO172,\"\")","v":""},null,null,{"$f":"IF(ISNUMBER(data1!AN172),data1!AR172,\"\")","v":""},null,{"$f":"IF(ISNUMBER(data1!AN172),data1!AT172,\"\")","v":""},null,null,null,{"$f":"IF(ISNUMBER(data1!AN172),data1!AX172,\"\")","v":""}]
[{"$f":"IF(ISNUMBER(data1!AN173),data1!AA173,\"\")","v":""},{"$f":"IF(ISNUMBER(data1!AN173),data1!AB173,\"\")","v":""},null,null,{"$f":"IF(ISNUMBER(data1!AN173),data1!AE173,\"\")","v":""},{"$f":"IF(ISNUMBER(data1!AN173),data1!AF173,\"\")","v":""},{"$f":"IF(ISNUMBER(data1!AN173),data1!AG173,\"\")","v":""},null,null,null,null,null,null,{"$f":"IF(ISNUMBER(data1!AN173),data1!AN173,\"\")","v":""},{"$f":"IF(ISNUMBER(data1!AN173),data1!AO173,\"\")","v":""},null,null,{"$f":"IF(ISNUMBER(data1!AN173),data1!AR173,\"\")","v":""},null,{"$f":"IF(ISNUMBER(data1!AN173),data1!AT173,\"\")","v":""},null,null,null,{"$f":"IF(ISNUMBER(data1!AN173),data1!AX173,\"\")","v":""}]
[{"$f":"IF(ISNUMBER(data1!AN174),data1!AA174,\"\")","v":""},{"$f":"IF(ISNUMBER(data1!AN174),data1!AB174,\"\")","v":""},null,null,{"$f":"IF(ISNUMBER(data1!AN174),data1!AE174,\"\")","v":""},{"$f":"IF(ISNUMBER(data1!AN174),data1!AF174,\"\")","v":""},{"$f":"IF(ISNUMBER(data1!AN174),data1!AG174,\"\")","v":""},null,null,null,null,null,null,{"$f":"IF(ISNUMBER(data1!AN174),data1!AN174,\"\")","v":""},{"$f":"IF(ISNUMBER(data1!AN174),data1!AO174,\"\")","v":""},null,null,{"$f":"IF(ISNUMBER(data1!AN174),data1!AR174,\"\")","v":""},null,{"$f":"IF(ISNUMBER(data1!AN174),data1!AT174,\"\")","v":""},null,null,null,{"$f":"IF(ISNUMBER(data1!AN174),data1!AX174,\"\")","v":""}]
[{"$f":"IF(ISNUMBER(data1!AN175),data1!AA175,\"\")","v":""},{"$f":"IF(ISNUMBER(data1!AN175),data1!AB175,\"\")","v":""},null,null,{"$f":"IF(ISNUMBER(data1!AN175),data1!AE175,\"\")","v":""},{"$f":"IF(ISNUMBER(data1!AN175),data1!AF175,\"\")","v":""},{"$f":"IF(ISNUMBER(data1!AN175),data1!AG175,\"\")","v":""},null,null,null,null,null,null,{"$f":"IF(ISNUMBER(data1!AN175),data1!AN175,\"\")","v":""},{"$f":"IF(ISNUMBER(data1!AN175),data1!AO175,\"\")","v":""},null,null,{"$f":"IF(ISNUMBER(data1!AN175),data1!AR175,\"\")","v":""},null,{"$f":"IF(ISNUMBER(data1!AN175),data1!AT175,\"\")","v":""},null,null,null,{"$f":"IF(ISNUMBER(data1!AN175),data1!AX175,\"\")","v":""}]
[{"$f":"IF(ISNUMBER(data1!AN176),data1!AA176,\"\")","v":""},{"$f":"IF(ISNUMBER(data1!AN176),data1!AB176,\"\")","v":""},null,null,{"$f":"IF(ISNUMBER(data1!AN176),data1!AE176,\"\")","v":""},{"$f":"IF(ISNUMBER(data1!AN176),data1!AF176,\"\")","v":""},{"$f":"IF(ISNUMBER(data1!AN176),data1!AG176,\"\")","v":""},null,null,null,null,null,null,{"$f":"IF(ISNUMBER(data1!AN176),data1!AN176,\"\")","v":""},{"$f":"IF(ISNUMBER(data1!AN176),data1!AO176,\"\")","v":""},null,null,{"$f":"IF(ISNUMBER(data1!AN176),data1!AR176,\"\")","v":""},null,{"$f":"IF(ISNUMBER(data1!AN176),data1!AT176,\"\")","v":""},null,null,null,{"$f":"IF(ISNUMBER(data1!AN176),data1!AX176,\"\")","v":""}]
[{"$f":"IF(ISNUMBER(data1!AN177),data1!AA177,\"\")","v":""},{"$f":"IF(ISNUMBER(data1!AN177),data1!AB177,\"\")","v":""},null,null,{"$f":"IF(ISNUMBER(data1!AN177),data1!AE177,\"\")","v":""},{"$f":"IF(ISNUMBER(data1!AN177),data1!AF177,\"\")","v":""},{"$f":"IF(ISNUMBER(data1!AN177),data1!AG177,\"\")","v":""},null,null,null,null,null,null,{"$f":"IF(ISNUMBER(data1!AN177),data1!AN177,\"\")","v":""},{"$f":"IF(ISNUMBER(data1!AN177),data1!AO177,\"\")","v":""},null,null,{"$f":"IF(ISNUMBER(data1!AN177),data1!AR177,\"\")","v":""},null,{"$f":"IF(ISNUMBER(data1!AN177),data1!AT177,\"\")","v":""},null,null,null,{"$f":"IF(ISNUMBER(data1!AN177),data1!AX177,\"\")","v":""}]
[{"$f":"IF(ISNUMBER(data1!AN178),data1!AA178,\"\")","v":""},{"$f":"IF(ISNUMBER(data1!AN178),data1!AB178,\"\")","v":""},null,null,{"$f":"IF(ISNUMBER(data1!AN178),data1!AE178,\"\")","v":""},{"$f":"IF(ISNUMBER(data1!AN178),data1!AF178,\"\")","v":""},{"$f":"IF(ISNUMBER(data1!AN178),data1!AG178,\"\")","v":""},null,null,null,null,null,null,{"$f":"IF(ISNUMBER(data1!AN178),data1!AN178,\"\")","v":""},{"$f":"IF(ISNUMBER(data1!AN178),data1!AO178,\"\")","v":""},null,null,{"$f":"IF(ISNUMBER(data1!AN178),data1!AR178,\"\")","v":""},null,{"$f":"IF(ISNUMBER(data1!AN178),data1!AT178,\"\")","v":""},null,null,null,{"$f":"IF(ISNUMBER(data1!AN178),data1!AX178,\"\")","v":""}]
[{"$f":"IF(ISNUMBER(data1!AN179),data1!AA179,\"\")","v":""},{"$f":"IF(ISNUMBER(data1!AN179),data1!AB179,\"\")","v":""},null,null,{"$f":"IF(ISNUMBER(data1!AN179),data1!AE179,\"\")","v":""},{"$f":"IF(ISNUMBER(data1!AN179),data1!AF179,\"\")","v":""},{"$f":"IF(ISNUMBER(data1!AN179),data1!AG179,\"\")","v":""},null,null,null,null,null,null,{"$f":"IF(ISNUMBER(data1!AN179),data1!AN179,\"\")","v":""},{"$f":"IF(ISNUMBER(data1!AN179),data1!AO179,\"\")","v":""},null,null,{"$f":"IF(ISNUMBER(data1!AN179),data1!AR179,\"\")","v":""},null,{"$f":"IF(ISNUMBER(data1!AN179),data1!AT179,\"\")","v":""},null,null,null,{"$f":"IF(ISNUMBER(data1!AN179),data1!AX179,\"\")","v":""}]
[{"$f":"IF(ISNUMBER(data1!AN180),data1!AA180,\"\")","v":""},{"$f":"IF(ISNUMBER(data1!AN180),data1!AB180,\"\")","v":""},null,null,{"$f":"IF(ISNUMBER(data1!AN180),data1!AE180,\"\")","v":""},{"$f":"IF(ISNUMBER(data1!AN180),data1!AF180,\"\")","v":""},{"$f":"IF(ISNUMBER(data1!AN180),data1!AG180,\"\")","v":""},null,null,null,null,null,null,{"$f":"IF(ISNUMBER(data1!AN180),data1!AN180,\"\")","v":""},{"$f":"IF(ISNUMBER(data1!AN180),data1!AO180,\"\")","v":""},null,null,{"$f":"IF(ISNUMBER(data1!AN180),data1!AR180,\"\")","v":""},null,{"$f":"IF(ISNUMBER(data1!AN180),data1!AT180,\"\")","v":""},null,null,null,{"$f":"IF(ISNUMBER(data1!AN180),data1!AX180,\"\")","v":""}]
[{"$f":"IF(ISNUMBER(data1!AN181),data1!AA181,\"\")","v":""},{"$f":"IF(ISNUMBER(data1!AN181),data1!AB181,\"\")","v":""},null,null,{"$f":"IF(ISNUMBER(data1!AN181),data1!AE181,\"\")","v":""},{"$f":"IF(ISNUMBER(data1!AN181),data1!AF181,\"\")","v":""},{"$f":"IF(ISNUMBER(data1!AN181),data1!AG181,\"\")","v":""},null,null,null,null,null,null,{"$f":"IF(ISNUMBER(data1!AN181),data1!AN181,\"\")","v":""},{"$f":"IF(ISNUMBER(data1!AN181),data1!AO181,\"\")","v":""},null,null,{"$f":"IF(ISNUMBER(data1!AN181),data1!AR181,\"\")","v":""},null,{"$f":"IF(ISNUMBER(data1!AN181),data1!AT181,\"\")","v":""},null,null,null,{"$f":"IF(ISNUMBER(data1!AN181),data1!AX181,\"\")","v":""}]
[{"$f":"IF(ISNUMBER(data1!AN182),data1!AA182,\"\")","v":""},{"$f":"IF(ISNUMBER(data1!AN182),data1!AB182,\"\")","v":""},null,null,{"$f":"IF(ISNUMBER(data1!AN182),data1!AE182,\"\")","v":""},{"$f":"IF(ISNUMBER(data1!AN182),data1!AF182,\"\")","v":""},{"$f":"IF(ISNUMBER(data1!AN182),data1!AG182,\"\")","v":""},null,null,null,null,null,null,{"$f":"IF(ISNUMBER(data1!AN182),data1!AN182,\"\")","v":""},{"$f":"IF(ISNUMBER(data1!AN182),data1!AO182,\"\")","v":""},null,null,{"$f":"IF(ISNUMBER(data1!AN182),data1!AR182,\"\")","v":""},null,{"$f":"IF(ISNUMBER(data1!AN182),data1!AT182,\"\")","v":""},null,null,null,{"$f":"IF(ISNUMBER(data1!AN182),data1!AX182,\"\")","v":""}]
[{"$f":"IF(ISNUMBER(data1!AN183),data1!AA183,\"\")","v":""},{"$f":"IF(ISNUMBER(data1!AN183),data1!AB183,\"\")","v":""},null,null,{"$f":"IF(ISNUMBER(data1!AN183),data1!AE183,\"\")","v":""},{"$f":"IF(ISNUMBER(data1!AN183),data1!AF183,\"\")","v":""},{"$f":"IF(ISNUMBER(data1!AN183),data1!AG183,\"\")","v":""},null,null,null,null,null,null,{"$f":"IF(ISNUMBER(data1!AN183),data1!AN183,\"\")","v":""},{"$f":"IF(ISNUMBER(data1!AN183),data1!AO183,\"\")","v":""},null,null,{"$f":"IF(ISNUMBER(data1!AN183),data1!AR183,\"\")","v":""},null,{"$f":"IF(ISNUMBER(data1!AN183),data1!AT183,\"\")","v":""},null,null,null,{"$f":"IF(ISNUMBER(data1!AN183),data1!AX183,\"\")","v":""}]
[{"$f":"IF(ISNUMBER(data1!AN184),data1!AA184,\"\")","v":""},{"$f":"IF(ISNUMBER(data1!AN184),data1!AB184,\"\")","v":""},null,null,{"$f":"IF(ISNUMBER(data1!AN184),data1!AE184,\"\")","v":""},{"$f":"IF(ISNUMBER(data1!AN184),data1!AF184,\"\")","v":""},{"$f":"IF(ISNUMBER(data1!AN184),data1!AG184,\"\")","v":""},null,null,null,null,null,null,{"$f":"IF(ISNUMBER(data1!AN184),data1!AN184,\"\")","v":""},{"$f":"IF(ISNUMBER(data1!AN184),data1!AO184,\"\")","v":""},null,null,{"$f":"IF(ISNUMBER(data1!AN184),data1!AR184,\"\")","v":""},null,{"$f":"IF(ISNUMBER(data1!AN184),data1!AT184,\"\")","v":""},null,null,null,{"$f":"IF(ISNUMBER(data1!AN184),data1!AX184,\"\")","v":""}]
[{"$f":"IF(ISNUMBER(data1!AN185),data1!AA185,\"\")","v":""},{"$f":"IF(ISNUMBER(data1!AN185),data1!AB185,\"\")","v":""},null,null,{"$f":"IF(ISNUMBER(data1!AN185),data1!AE185,\"\")","v":""},{"$f":"IF(ISNUMBER(data1!AN185),data1!AF185,\"\")","v":""},{"$f":"IF(ISNUMBER(data1!AN185),data1!AG185,\"\")","v":""},null,null,null,null,null,null,{"$f":"IF(ISNUMBER(data1!AN185),data1!AN185,\"\")","v":""},{"$f":"IF(ISNUMBER(data1!AN185),data1!AO185,\"\")","v":""},null,null,{"$f":"IF(ISNUMBER(data1!AN185),data1!AR185,\"\")","v":""},null,{"$f":"IF(ISNUMBER(data1!AN185),data1!AT185,\"\")","v":""},null,null,null,{"$f":"IF(ISNUMBER(data1!AN185),data1!AX185,\"\")","v":""}]
[{"$f":"IF(ISNUMBER(data1!AN186),data1!AA186,\"\")","v":""},{"$f":"IF(ISNUMBER(data1!AN186),data1!AB186,\"\")","v":""},null,null,{"$f":"IF(ISNUMBER(data1!AN186),data1!AE186,\"\")","v":""},{"$f":"IF(ISNUMBER(data1!AN186),data1!AF186,\"\")","v":""},{"$f":"IF(ISNUMBER(data1!AN186),data1!AG186,\"\")","v":""},null,null,null,null,null,null,{"$f":"IF(ISNUMBER(data1!AN186),data1!AN186,\"\")","v":""},{"$f":"IF(ISNUMBER(data1!AN186),data1!AO186,\"\")","v":""},null,null,{"$f":"IF(ISNUMBER(data1!AN186),data1!AR186,\"\")","v":""},null,{"$f":"IF(ISNUMBER(data1!AN186),data1!AT186,\"\")","v":""},null,null,null,{"$f":"IF(ISNUMBER(data1!AN186),data1!AX186,\"\")","v":""}]
[{"$f":"IF(ISNUMBER(data1!AN187),data1!AA187,\"\")","v":""},{"$f":"IF(ISNUMBER(data1!AN187),data1!AB187,\"\")","v":""},null,null,{"$f":"IF(ISNUMBER(data1!AN187),data1!AE187,\"\")","v":""},{"$f":"IF(ISNUMBER(data1!AN187),data1!AF187,\"\")","v":""},{"$f":"IF(ISNUMBER(data1!AN187),data1!AG187,\"\")","v":""},null,null,null,null,null,null,{"$f":"IF(ISNUMBER(data1!AN187),data1!AN187,\"\")","v":""},{"$f":"IF(ISNUMBER(data1!AN187),data1!AO187,\"\")","v":""},null,null,{"$f":"IF(ISNUMBER(data1!AN187),data1!AR187,\"\")","v":""},null,{"$f":"IF(ISNUMBER(data1!AN187),data1!AT187,\"\")","v":""},null,null,null,{"$f":"IF(ISNUMBER(data1!AN187),data1!AX187,\"\")","v":""}]
[{"$f":"IF(ISNUMBER(data1!AN188),data1!AA188,\"\")","v":""},{"$f":"IF(ISNUMBER(data1!AN188),data1!AB188,\"\")","v":""},null,null,{"$f":"IF(ISNUMBER(data1!AN188),data1!AE188,\"\")","v":""},{"$f":"IF(ISNUMBER(data1!AN188),data1!AF188,\"\")","v":""},{"$f":"IF(ISNUMBER(data1!AN188),data1!AG188,\"\")","v":""},null,null,null,null,null,null,{"$f":"IF(ISNUMBER(data1!AN188),data1!AN188,\"\")","v":""},{"$f":"IF(ISNUMBER(data1!AN188),data1!AO188,\"\")","v":""},null,null,{"$f":"IF(ISNUMBER(data1!AN188),data1!AR188,\"\")","v":""},null,{"$f":"IF(ISNUMBER(data1!AN188),data1!AT188,\"\")","v":""},null,null,null,{"$f":"IF(ISNUMBER(data1!AN188),data1!AX188,\"\")","v":""}]
[{"$f":"IF(ISNUMBER(data1!AN189),data1!AA189,\"\")","v":""},{"$f":"IF(ISNUMBER(data1!AN189),data1!AB189,\"\")","v":""},null,null,{"$f":"IF(ISNUMBER(data1!AN189),data1!AE189,\"\")","v":""},{"$f":"IF(ISNUMBER(data1!AN189),data1!AF189,\"\")","v":""},{"$f":"IF(ISNUMBER(data1!AN189),data1!AG189,\"\")","v":""},null,null,null,null,null,null,{"$f":"IF(ISNUMBER(data1!AN189),data1!AN189,\"\")","v":""},{"$f":"IF(ISNUMBER(data1!AN189),data1!AO189,\"\")","v":""},null,null,{"$f":"IF(ISNUMBER(data1!AN189),data1!AR189,\"\")","v":""},null,{"$f":"IF(ISNUMBER(data1!AN189),data1!AT189,\"\")","v":""},null,null,null,{"$f":"IF(ISNUMBER(data1!AN189),data1!AX189,\"\")","v":""}]
[{"$f":"IF(ISNUMBER(data1!AN190),data1!AA190,\"\")","v":""},{"$f":"IF(ISNUMBER(data1!AN190),data1!AB190,\"\")","v":""},null,null,{"$f":"IF(ISNUMBER(data1!AN190),data1!AE190,\"\")","v":""},{"$f":"IF(ISNUMBER(data1!AN190),data1!AF190,\"\")","v":""},{"$f":"IF(ISNUMBER(data1!AN190),data1!AG190,\"\")","v":""},null,null,null,null,null,null,{"$f":"IF(ISNUMBER(data1!AN190),data1!AN190,\"\")","v":""},{"$f":"IF(ISNUMBER(data1!AN190),data1!AO190,\"\")","v":""},null,null,{"$f":"IF(ISNUMBER(data1!AN190),data1!AR190,\"\")","v":""},null,{"$f":"IF(ISNUMBER(data1!AN190),data1!AT190,\"\")","v":""},null,null,null,{"$f":"IF(ISNUMBER(data1!AN190),data1!AX190,\"\")","v":""}]
[{"$f":"IF(ISNUMBER(data1!AN191),data1!AA191,\"\")","v":""},{"$f":"IF(ISNUMBER(data1!AN191),data1!AB191,\"\")","v":""},null,null,{"$f":"IF(ISNUMBER(data1!AN191),data1!AE191,\"\")","v":""},{"$f":"IF(ISNUMBER(data1!AN191),data1!AF191,\"\")","v":""},{"$f":"IF(ISNUMBER(data1!AN191),data1!AG191,\"\")","v":""},null,null,null,null,null,null,{"$f":"IF(ISNUMBER(data1!AN191),data1!AN191,\"\")","v":""},{"$f":"IF(ISNUMBER(data1!AN191),data1!AO191,\"\")","v":""},null,null,{"$f":"IF(ISNUMBER(data1!AN191),data1!AR191,\"\")","v":""},null,{"$f":"IF(ISNUMBER(data1!AN191),data1!AT191,\"\")","v":""},null,null,null,{"$f":"IF(ISNUMBER(data1!AN191),data1!AX191,\"\")","v":""}]
[{"$f":"IF(ISNUMBER(data1!AN192),data1!AA192,\"\")","v":""},{"$f":"IF(ISNUMBER(data1!AN192),data1!AB192,\"\")","v":""},null,null,{"$f":"IF(ISNUMBER(data1!AN192),data1!AE192,\"\")","v":""},{"$f":"IF(ISNUMBER(data1!AN192),data1!AF192,\"\")","v":""},{"$f":"IF(ISNUMBER(data1!AN192),data1!AG192,\"\")","v":""},null,null,null,null,null,null,{"$f":"IF(ISNUMBER(data1!AN192),data1!AN192,\"\")","v":""},{"$f":"IF(ISNUMBER(data1!AN192),data1!AO192,\"\")","v":""},null,null,{"$f":"IF(ISNUMBER(data1!AN192),data1!AR192,\"\")","v":""},null,{"$f":"IF(ISNUMBER(data1!AN192),data1!AT192,\"\")","v":""},null,null,null,{"$f":"IF(ISNUMBER(data1!AN192),data1!AX192,\"\")","v":""}]
[{"$f":"IF(ISNUMBER(data1!AN193),data1!AA193,\"\")","v":""},{"$f":"IF(ISNUMBER(data1!AN193),data1!AB193,\"\")","v":""},null,null,{"$f":"IF(ISNUMBER(data1!AN193),data1!AE193,\"\")","v":""},{"$f":"IF(ISNUMBER(data1!AN193),data1!AF193,\"\")","v":""},{"$f":"IF(ISNUMBER(data1!AN193),data1!AG193,\"\")","v":""},null,null,null,null,null,null,{"$f":"IF(ISNUMBER(data1!AN193),data1!AN193,\"\")","v":""},{"$f":"IF(ISNUMBER(data1!AN193),data1!AO193,\"\")","v":""},null,null,{"$f":"IF(ISNUMBER(data1!AN193),data1!AR193,\"\")","v":""},null,{"$f":"IF(ISNUMBER(data1!AN193),data1!AT193,\"\")","v":""},null,null,null,{"$f":"IF(ISNUMBER(data1!AN193),data1!AX193,\"\")","v":""}]
[{"$f":"IF(ISNUMBER(data1!AN194),data1!AA194,\"\")","v":""},{"$f":"IF(ISNUMBER(data1!AN194),data1!AB194,\"\")","v":""},null,null,{"$f":"IF(ISNUMBER(data1!AN194),data1!AE194,\"\")","v":""},{"$f":"IF(ISNUMBER(data1!AN194),data1!AF194,\"\")","v":""},{"$f":"IF(ISNUMBER(data1!AN194),data1!AG194,\"\")","v":""},null,null,null,null,null,null,{"$f":"IF(ISNUMBER(data1!AN194),data1!AN194,\"\")","v":""},{"$f":"IF(ISNUMBER(data1!AN194),data1!AO194,\"\")","v":""},null,null,{"$f":"IF(ISNUMBER(data1!AN194),data1!AR194,\"\")","v":""},null,{"$f":"IF(ISNUMBER(data1!AN194),data1!AT194,\"\")","v":""},null,null,null,{"$f":"IF(ISNUMBER(data1!AN194),data1!AX194,\"\")","v":""}]
[{"$f":"IF(ISNUMBER(data1!AN195),data1!AA195,\"\")","v":""},{"$f":"IF(ISNUMBER(data1!AN195),data1!AB195,\"\")","v":""},null,null,{"$f":"IF(ISNUMBER(data1!AN195),data1!AE195,\"\")","v":""},{"$f":"IF(ISNUMBER(data1!AN195),data1!AF195,\"\")","v":""},{"$f":"IF(ISNUMBER(data1!AN195),data1!AG195,\"\")","v":""},null,null,null,null,null,null,{"$f":"IF(ISNUMBER(data1!AN195),data1!AN195,\"\")","v":""},{"$f":"IF(ISNUMBER(data1!AN195),data1!AO195,\"\")","v":""},null,null,{"$f":"IF(ISNUMBER(data1!AN195),data1!AR195,\"\")","v":""},null,{"$f":"IF(ISNUMBER(data1!AN195),data1!AT195,\"\")","v":""},null,null,null,{"$f":"IF(ISNUMBER(data1!AN195),data1!AX195,\"\")","v":""}]
[{"$f":"IF(ISNUMBER(data1!AN196),data1!AA196,\"\")","v":""},{"$f":"IF(ISNUMBER(data1!AN196),data1!AB196,\"\")","v":""},null,null,{"$f":"IF(ISNUMBER(data1!AN196),data1!AE196,\"\")","v":""},{"$f":"IF(ISNUMBER(data1!AN196),data1!AF196,\"\")","v":""},{"$f":"IF(ISNUMBER(data1!AN196),data1!AG196,\"\")","v":""},null,null,null,null,null,null,{"$f":"IF(ISNUMBER(data1!AN196),data1!AN196,\"\")","v":""},{"$f":"IF(ISNUMBER(data1!AN196),data1!AO196,\"\")","v":""},null,null,{"$f":"IF(ISNUMBER(data1!AN196),data1!AR196,\"\")","v":""},null,{"$f":"IF(ISNUMBER(data1!AN196),data1!AT196,\"\")","v":""},null,null,null,{"$f":"IF(ISNUMBER(data1!AN196),data1!AX196,\"\")","v":""}]
[{"$f":"IF(ISNUMBER(data1!AN197),data1!AA197,\"\")","v":""},{"$f":"IF(ISNUMBER(data1!AN197),data1!AB197,\"\")","v":""},null,null,{"$f":"IF(ISNUMBER(data1!AN197),data1!AE197,\"\")","v":""},{"$f":"IF(ISNUMBER(data1!AN197),data1!AF197,\"\")","v":""},{"$f":"IF(ISNUMBER(data1!AN197),data1!AG197,\"\")","v":""},null,null,null,null,null,null,{"$f":"IF(ISNUMBER(data1!AN197),data1!AN197,\"\")","v":""},{"$f":"IF(ISNUMBER(data1!AN197),data1!AO197,\"\")","v":""},null,null,{"$f":"IF(ISNUMBER(data1!AN197),data1!AR197,\"\")","v":""},null,{"$f":"IF(ISNUMBER(data1!AN197),data1!AT197,\"\")","v":""},null,null,null,{"$f":"IF(ISNUMBER(data1!AN197),data1!AX197,\"\")","v":""}]
[{"$f":"IF(ISNUMBER(data1!AN198),data1!AA198,\"\")","v":""},{"$f":"IF(ISNUMBER(data1!AN198),data1!AB198,\"\")","v":""},null,null,{"$f":"IF(ISNUMBER(data1!AN198),data1!AE198,\"\")","v":""},{"$f":"IF(ISNUMBER(data1!AN198),data1!AF198,\"\")","v":""},{"$f":"IF(ISNUMBER(data1!AN198),data1!AG198,\"\")","v":""},null,null,null,null,null,null,{"$f":"IF(ISNUMBER(data1!AN198),data1!AN198,\"\")","v":""},{"$f":"IF(ISNUMBER(data1!AN198),data1!AO198,\"\")","v":""},null,null,{"$f":"IF(ISNUMBER(data1!AN198),data1!AR198,\"\")","v":""},null,{"$f":"IF(ISNUMBER(data1!AN198),data1!AT198,\"\")","v":""},null,null,null,{"$f":"IF(ISNUMBER(data1!AN198),data1!AX198,\"\")","v":""}]
[{"$f":"IF(ISNUMBER(data1!AN199),data1!AA199,\"\")","v":""},{"$f":"IF(ISNUMBER(data1!AN199),data1!AB199,\"\")","v":""},null,null,{"$f":"IF(ISNUMBER(data1!AN199),data1!AE199,\"\")","v":""},{"$f":"IF(ISNUMBER(data1!AN199),data1!AF199,\"\")","v":""},{"$f":"IF(ISNUMBER(data1!AN199),data1!AG199,\"\")","v":""},null,null,null,null,null,null,{"$f":"IF(ISNUMBER(data1!AN199),data1!AN199,\"\")","v":""},{"$f":"IF(ISNUMBER(data1!AN199),data1!AO199,\"\")","v":""},null,null,{"$f":"IF(ISNUMBER(data1!AN199),data1!AR199,\"\")","v":""},null,{"$f":"IF(ISNUMBER(data1!AN199),data1!AT199,\"\")","v":""},null,null,null,{"$f":"IF(ISNUMBER(data1!AN199),data1!AX199,\"\")","v":""}]
[{"$f":"IF(ISNUMBER(data1!AN200),data1!AA200,\"\")","v":""},{"$f":"IF(ISNUMBER(data1!AN200),data1!AB200,\"\")","v":""},null,null,{"$f":"IF(ISNUMBER(data1!AN200),data1!AE200,\"\")","v":""},{"$f":"IF(ISNUMBER(data1!AN200),data1!AF200,\"\")","v":""},{"$f":"IF(ISNUMBER(data1!AN200),data1!AG200,\"\")","v":""},null,null,null,null,null,null,{"$f":"IF(ISNUMBER(data1!AN200),data1!AN200,\"\")","v":""},{"$f":"IF(ISNUMBER(data1!AN200),data1!AO200,\"\")","v":""},null,null,{"$f":"IF(ISNUMBER(data1!AN200),data1!AR200,\"\")","v":""},null,{"$f":"IF(ISNUMBER(data1!AN200),data1!AT200,\"\")","v":""},null,null,null,{"$f":"IF(ISNUMBER(data1!AN200),data1!AX200,\"\")","v":""}]
[{"$f":"IF(ISNUMBER(data1!AN201),data1!AA201,\"\")","v":""},{"$f":"IF(ISNUMBER(data1!AN201),data1!AB201,\"\")","v":""},null,null,{"$f":"IF(ISNUMBER(data1!AN201),data1!AE201,\"\")","v":""},{"$f":"IF(ISNUMBER(data1!AN201),data1!AF201,\"\")","v":""},{"$f":"IF(ISNUMBER(data1!AN201),data1!AG201,\"\")","v":""},null,null,null,null,null,null,{"$f":"IF(ISNUMBER(data1!AN201),data1!AN201,\"\")","v":""},{"$f":"IF(ISNUMBER(data1!AN201),data1!AO201,\"\")","v":""},null,null,{"$f":"IF(ISNUMBER(data1!AN201),data1!AR201,\"\")","v":""},null,{"$f":"IF(ISNUMBER(data1!AN201),data1!AT201,\"\")","v":""},null,null,null,{"$f":"IF(ISNUMBER(data1!AN201),data1!AX201,\"\")","v":""}]

{"sheet":"evidence","index":1,"n_rows":1,"n_cols":19,"rows_kept":1,"cut":false,"hidden":false,"merged":[]}
["Jméno","Další jména","Příjmení","Datum narození","Rodné číslo","Název obce","Název části obce","Název ulice","Číslo popisné","Číslo orientační ","PSČ","SDH","IČO SDH","Aktivní sportovec","Sportovec v soutěži","Trenér","Členství od","Občanství","Evidenční číslo"]

{"sheet":"data","index":2,"n_rows":305,"n_cols":157,"rows_kept":305,"cut":false,"hidden":false,"merged":[]}
[{"$f":"CONCATENATE(G4,\" \",H4)","v":"0 0"},null,null,null,null,null,null,null,null,null,null,null,null,null,null,null,null,null,null,null,null,null,null,null,1,0,null,null,null,null,null,null,null,null,null,null,null,null,null,null,null,null,null,null,null,null,null,null,null,null,null,null,null,null,null,null,null,null,null,null,null,null,null,null,null,null,null,null,null,null,null,null,null,null,null,null,null,null,"Jméno","Další jména","Příjmení","Datum narození","18 let","Rodné číslo","SDH","IČO SDH","Aktivní sportovec","Sportovec v soutěži","Trenér","Sportovec","Trenér","VÝBĚR","Členství od","Sportovec od","Trenér od","Občanství","Evidenční číslo",null,null,null,null,null,null,null,null,"JMENO","PRIJMENI","TITUL_PRED","TITUL_ZA","RODNE_CISLO","OBCANSTVI","DATUM_NAROZENI","NAZEV_OBCE","NAZEV_CASTI_OBCE","NAZEV_ULICE","CISLO_POPISNE","CISLO_ORIENTACNI","PSC","SPORTOVEC","SPORTOVCEM_OD","SPORTOVCEM_DO","SPORTOVEC_CETNOST","SPORTOVEC_DRUH_SPORTU","SPORTOVEC_UCAST_SOUTEZE","TRENER","TRENEREM_OD","TRENEREM_DO","TRENER_CETNOST","TRENER_DRUH_SPORTU","EXT_ID"]
[null,null,null,null,18,null,null,null,null,null,null,null,null,null,null,null,2016,null,null,null,null,null,null,null,2,1,"VYBERE ČLENY JEN S ÚPLNÝM RODNÝM ČÍSLEM",null,null,null,null,null,null,null,null,null,null,null,null,null,null,null,null,null,null,null,null,null,null,null,null,null,"VYBERE SPORTOVCE A TRENÉRY",null,null,null,null,null,null,null,null,null,null,null,null,null,null,null,null,null,null,null,null,null,null,null,null,null,"MAKRO POSKLÁDÁ PODLE SLOUPCE CN VÝBĚR",null,null,null,null,null,null,null,null,null,null,null,null,null,null,null,null,null,null,null,null,null,null,null,null,null,"ZRUŠÍ NULY",null,null,null,null,null,null,null,null,null,null,null,null,null,null,null,null,null,null,null,null,null,null,null,86]
["Jméno","Další jména","Příjmení","Datum narození","18 let","Rodné číslo","SDH","IČO SDH","Aktivní sportovec","Sportovec v soutěži","Trenér","Sportovec","Trenér","VÝBĚR","Členství od","Sportovec od","Trenér od","Občanství","Evidenční číslo","RČ1","RČ2","Název obce","PSČ",null,null,null,"Jméno","Další jména","Příjmení","Datum narození","18 let","Rodné číslo","SDH","IČO SDH","Aktivní sportovec","Sportovec v soutěži","Trenér","Sportovec","Trenér","VÝBĚR","Členství od","Sportovec od","Trenér od","Občanství","Evidenční číslo","Název obce","PSČ",null,null,null,null,null,"Jméno","Další jména","Příjmení","Datum narození","18 let","Rodné číslo","SDH","IČO SDH","Aktivní sportovec","Sportovec v soutěži","Trenér","Sportovec","Trenér","VÝBĚR","Členství od","Sportovec od","Trenér od","Občanství","Evidenční číslo","Název obce","PSČ","RČ1","PSČ",null,null,null,"Jméno","Další jména","Příjmení","Datum narození","18 let","Rodné číslo","SDH","IČO SDH","Aktivní sportovec","Sportovec v soutěži","Trenér","Sportovec","Trenér","VÝBĚR","Členství od","Sportovec od","Trenér od","Občanství","Evidenční číslo","Název obce","PSČ",null,null,null,null,null,"SDH","JMENO","PRIJMENI","TITUL_PRED","TITUL_ZA","RODNE_CISLO","OBCANSTVI","DATUM_NAROZENI","NAZEV_OBCE","NAZEV_CASTI_OBCE","NAZEV_ULICE","CISLO_POPISNE","CISLO_ORIENTACNI","PSC","SPORTOVEC","SPORTOVCEM_OD","SPORTOVCEM_DO","SPORTOVEC_CETNOST","SPORTOVEC_DRUH_SPORTU",null,"TRENER","TRENEREM_OD","TRENEREM_DO","TRENER_CETNOST","TRENER_DRUH_SPORTU","EXT_ID","SDH","JMENO","PRIJMENI","TITUL_PRED","TITUL_ZA","RODNE_CISLO","OBCANSTVI","DATUM_NAROZENI","NAZEV_OBCE","NAZEV_CASTI_OBCE","NAZEV_ULICE","CISLO_POPISNE","CISLO_ORIENTACNI","PSC","SPORTOVEC","SPORTOVCEM_OD","SPORTOVCEM_DO","SPORTOVEC_CETNOST","SPORTOVEC_DRUH_SPORTU",null,"TRENER","TRENEREM_OD","TRENEREM_DO","TRENER_CETNOST","TRENER_DRUH_SPORTU","EXT_ID"]
[{"$f":"evidence!A2","v":0},{"$f":"IF(ISTEXT(evidence!B2),evidence!B2,\"\")","v":""},{"$f":"evidence!C2","v":0},{"$f":"evidence!D2","v":0},{"$f":"YEAR(D4)+$E$2","v":1918},{"$f":"evidence!E2","v":0},{"$f":"evidence!L2","v":0},{"$f":"evidence!M2","v":0},{"$f":"evidence!N2","v":0},{"$f":"evidence!O2","v":0},{"$f":"evidence!P2","v":0},{"$f":"IF((I4=\"ano\"),1,IF(OR(J4=\"ano\"),1,0))","v":0},{"$f":"IF((K4=\"ano\"),1,0)","v":0},{"$f":"IF((T4=\"ANO\"),SUM(L4:M4),0)","v":0},{"$f":"evidence!Q2","v":"00:00:00"},{"$f":"YEAR(O4)","v":1900},{"$f":"MAX(E4,P4,$Q$2)","v":2016},{"$f":"IF(ISTEXT(A4),1,0)","v":0},{"$f":"evidence!S2","v":0},{"$f":"IF(LEN(F4)<9,\"\",\"ANO\")","v":""},null,{"$f":"evidence!F2","v":0},{"$f":"evidence!K2","v":0},null,null,null,{"$f":"IF((T4=\"ANO\"),A4,0)","v":0},{"$f":"IF((T4=\"ANO\"),B4,0)","v":0},{"$f":"IF((T4=\"ANO\"),C4,0)","v":0},{"$f":"IF((T4=\"ANO\"),D4,0)","v":0},{"$f":"IF((T4=\"ANO\"),E4,0)","v":0},{"$f":"IF((T4=\"ANO\"),F4,0)","v":0},{"$f":"IF((T4=\"ANO\"),G4,0)","v":0},{"$f":"IF((T4=\"ANO\"),H4,0)","v":0},{"$f":"IF((T4=\"ANO\"),I4,0)","v":0},{"$f":"IF((T4=\"ANO\"),J4,0)","v":0},{"$f":"IF((T4=\"ANO\"),K4,0)","v":0},{"$f":"IF((T4=\"ANO\"),L4,0)","v":0},{"$f":"IF((T4=\"ANO\"),M4,0)","v":0},{"$f":"IF((T4=\"ANO\"),N4,0)","v":0},{"$f":"IF((T4=\"ANO\"),O4,0)","v":0},{"$f":"IF((T4=\"ANO\"),P4,0)","v":0},{"$f":"IF((T4=\"ANO\"),Q4,0)","v":0},{"$f":"IF((T4=\"ANO\"),R4,0)","v":0},{"$f":"IF((T4=\"ANO\"),S4,0)","v":0},{"$f":"IF((T4=\"ANO\"),V4,0)","v":0},{"$f":"IF((T4=\"ANO\"),W4,0)","v":0},null,null,null,null,null,{"$f":"IF((AN4>0),A4,0)","v":0},{"$f":"IF((AN4>0),B4,0)","v":0},{"$f":"IF((AN4>0),C4,0)","v":0},{"$f":"IF((AN4>0),D4,0)","v":0},{"$f":"IF((AN4>0),E4,0)","v":0},{"$f":"IF((AN4>0),F4,\"RODNE_CISLO\")","v":"RODNE_CISLO"},{"$f":"IF((AN4>0),G4,0)","v":0},{"$f":"IF((AN4>0),H4,0)","v":0},null,null,null,{"$f":"IF((AL4>0),L4,0)","v":0},{"$f":"IF((AM4>0),M4,0)","v":0},{"$f":"IF((AN4>0),N4,0)","v":0},{"$f":"IF((AN4>0),O4,0)","v":0},{"$f":"IF((AL4>0),P4,\"\")","v":""},{"$f":"IF((AM4>0),Q4,\"\")","v":""},{"$f":"IF((AN4>0),R4,0)","v":0},{"$f":"IF((AN4>0),S4,0)","v":0},{"$f":"IF((AN4>0),AT4,0)","v":0},{"$f":"IF((AN4>0),AU4,0)","v":0},{"$f":"IF((AN4>0),T4,0)","v":0},{"$f":"IF((AN4>0),AU4,0)","v":0},null,null,null,null,null,null,null,null,null,null,null,null,null,null,null,null,null,null,null,null,null,null,null,null,null,null,null,null,null,{"$f":"IF(ISTEXT(CA4),CG4,\"\")","v":""},{"$f":"IF(ISTEXT(CA4),CA4,\"\")","v":""},{"$f":"IF(ISTEXT(CA4),CC4,\"\")","v":""},null,null,{"$f":"IF(ISTEXT(CA4),CF4,\"RODNE_CISLO\")","v":"RODNE_CISLO"},{"$f":"IF(ISTEXT(CA4),\"CZE\",\"\")","v":""},{"$f":"IF(ISTEXT(CA4),CD4,\"\")","v":""},null,null,null,null,null,null,{"$f":"IF(ISTEXT(CA4),CL4,\"\")","v":""},{"$f":"IF(ISTEXT(CA4),CO4,\"\")","v":""},null,null,{"$f":"IF(ISTEXT(CA4),$DY$2,\"\")","v":""},null,{"$f":"IF(ISTEXT(CA4),CM4,\"\")","v":""},null,null,null,{"$f":"IF(ISTEXT(CA4),$DY$2,\"\")","v":""},null,null,null,null,null,null,null,null,null,null,null,null,null,null,null,null,null,null,null,null,null,null,null,null,null,null,null,{"$f":"A1","v":"0 0"}]
[{"$f":"evidence!A3","v":0},{"$f":"IF(ISTEXT(evidence!B3),evidence!B3,\"\")","v":""},{"$f":"evidence!C3","v":0},{"$f":"evidence!D3","v":0},{"$f":"YEAR(D5)+$E$2","v":1918},{"$f":"evidence!E3","v":0},{"$f":"evidence!L3","v":0},{"$f":"evidence!M3","v":0},{"$f":"evidence!N3","v":0},{"$f":"evidence!O3","v":0},{"$f":"evidence!P3","v":0},{"$f":"IF((I5=\"ano\"),1,IF(OR(J5=\"ano\"),1,0))","v":0},{"$f":"IF((K5=\"ano\"),1,0)","v":0},{"$f":"IF((T5=\"ANO\"),SUM(L5:M5),0)","v":0},{"$f":"evidence!Q3","v":"00:00:00"},{"$f":"YEAR(O5)","v":1900},{"$f":"MAX(E5,P5,$Q$2)","v":2016},{"$f":"IF(ISTEXT(A5),1,0)","v":0},{"$f":"evidence!S3","v":0},{"$f":"IF(LEN(F5)<9,\"\",\"ANO\")","v":""},null,{"$f":"evidence!F3","v":0},{"$f":"evidence!K3","v":0},null,null,null,{"$f":"IF((T5=\"ANO\"),A5,0)","v":0},{"$f":"IF((T5=\"ANO\"),B5,0)","v":0},{"$f":"IF((T5=\"ANO\"),C5,0)","v":0},{"$f":"IF((T5=\"ANO\"),D5,0)","v":0},{"$f":"IF((T5=\"ANO\"),E5,0)","v":0},{"$f":"IF((T5=\"ANO\"),F5,0)","v":0},{"$f":"IF((T5=\"ANO\"),G5,0)","v":0},{"$f":"IF((T5=\"ANO\"),H5,0)","v":0},{"$f":"IF((T5=\"ANO\"),I5,0)","v":0},{"$f":"IF((T5=\"ANO\"),J5,0)","v":0},{"$f":"IF((T5=\"ANO\"),K5,0)","v":0},{"$f":"IF((T5=\"ANO\"),L5,0)","v":0},{"$f":"IF((T5=\"ANO\"),M5,0)","v":0},{"$f":"IF((T5=\"ANO\"),N5,0)","v":0},{"$f":"IF((T5=\"ANO\"),O5,0)","v":0},{"$f":"IF((T5=\"ANO\"),P5,0)","v":0},{"$f":"IF((T5=\"ANO\"),Q5,0)","v":0},{"$f":"IF((T5=\"ANO\"),R5,0)","v":0},{"$f":"IF((T5=\"ANO\"),S5,0)","v":0},{"$f":"IF((T5=\"ANO\"),V5,0)","v":0},{"$f":"IF((T5=\"ANO\"),W5,0)","v":0},null,null,null,null,null,{"$f":"IF((AN5>0),A5,0)","v":0},{"$f":"IF((AN5>0),B5,0)","v":0},{"$f":"IF((AN5>0),C5,0)","v":0},{"$f":"IF((AN5>0),D5,0)","v":0},{"$f":"IF((AN5>0),E5,0)","v":0},{"$f":"IF((AN5>0),F5,\"RODNE_CISLO\")","v":"RODNE_CISLO"},{"$f":"IF((AN5>0),G5,0)","v":0},{"$f":"IF((AN5>0),H5,0)","v":0},null,null,null,{"$f":"IF((AL5>0),L5,0)","v":0},{"$f":"IF((AM5>0),M5,0)","v":0},{"$f":"IF((AN5>0),N5,0)","v":0},{"$f":"IF((AN5>0),O5,0)","v":0},{"$f":"IF((AL5>0),P5,\"\")","v":""},{"$f":"IF((AM5>0),Q5,\"\")","v":""},{"$f":"IF((AN5>0),R5,0)","v":0},{"$f":"IF((AN5>0),S5,0)","v":0},{"$f":"IF((AN5>0),AT5,0)","v":0},{"$f":"IF((AN5>0),AU5,0)","v":0},0,0,null,null,null,null,null,null,null,null,null,null,null,null,null,null,null,null,null,null,null,null,null,null,null,null,null,null,null,null,null,{"$f":"IF(ISTEXT(CA5),CG5,\"\")","v":""},{"$f":"IF(ISTEXT(CA5),CA5,\"\")","v":""},{"$f":"IF(ISTEXT(CA5),CC5,\"\")","v":""},null,null,{"$f":"IF(ISTEXT(CA5),CF5,\"RODNE_CISLO\")","v":"RODNE_CISLO"},{"$f":"IF(ISTEXT(CA5),\"CZE\",\"\")","v":""},{"$f":"IF(ISTEXT(CA5),CD5,\"\")","v":""},null,null,null,null,null,null,{"$f":"IF(ISTEXT(CA5),CL5,\"\")","v":""},{"$f":"IF(ISTEXT(CA5),CO5,\"\")","v":""},null,null,{"$f":"IF(ISTEXT(CA5),$DY$2,\"\")","v":""},null,{"$f":"IF(ISTEXT(CA5),CM5,\"\")","v":""},null,null,null,{"$f":"IF(ISTEXT(CA5),$DY$2,\"\")","v":""},null,""]
[{"$f":"evidence!A4","v":0},{"$f":"IF(ISTEXT(evidence!B4),evidence!B4,\"\")","v":""},{"$f":"evidence!C4","v":0},{"$f":"evidence!D4","v":0},1918,{"$f":"evidence!E4","v":0},{"$f":"evidence!L4","v":0},{"$f":"evidence!M4","v":0},{"$f":"evidence!N4","v":0},{"$f":"evidence!O4","v":0},{"$f":"evidence!P4","v":0},0,0,0,{"$f":"evidence!Q4","v":"00:00:00"},1900,2016,0,{"$f":"evidence!S4","v":0},"",null,{"$f":"evidence!F4","v":0},{"$f":"evidence!K4","v":0},null,null,null,0,0,0,0,0,0,0,0,0,0,0,0,0,0,0,0,0,0,0,0,0,null,null,null,null,null,0,0,0,0,0,"RODNE_CISLO",0,0,null,null,null,0,0,0,0,"","",0,0,0,0,0,0,null,null,null,null,null,null,null,null,null,null,null,null,null,null,null,null,null,null,null,null,null,null,null,null,null,null,null,null,null,"","","",null,null,"RODNE_CISLO","","",null,null,null,null,null,null,"","",null,null,"",null,"",null,null,null,""]
[{"$f":"evidence!A5","v":0},{"$f":"IF(ISTEXT(evidence!B5),evidence!B5,\"\")","v":""},{"$f":"evidence!C5","v":0},{"$f":"evidence!D5","v":0},1918,{"$f":"evidence!E5","v":0},{"$f":"evidence!L5","v":0},{"$f":"evidence!M5","v":0},{"$f":"evidence!N5","v":0},{"$f":"evidence!O5","v":0},{"$f":"evidence!P5","v":0},0,0,0,{"$f":"evidence!Q5","v":"00:00:00"},1900,2016,0,{"$f":"evidence!S5","v":0},"",null,{"$f":"evidence!F5","v":0},{"$f":"evidence!K5","v":0},null,null,null,0,0,0,0,0,0,0,0,0,0,0,0,0,0,0,0,0,0,0,0,0,null,null,null,null,null,0,0,0,0,0,"RODNE_CISLO",0,0,null,null,null,0,0,0,0,"","",0,0,0,0,0,0,null,null,null,null,null,null,null,null,null,null,null,null,null,null,null,null,null,null,null,null,null,null,null,null,null,null,null,null,null,"","","",null,null,"RODNE_CISLO","","",null,null,null,null,null,null,"","",null,null,"",null,"",null,null,null,""]
[{"$f":"evidence!A6","v":0},{"$f":"IF(ISTEXT(evidence!B6),evidence!B6,\"\")","v":""},{"$f":"evidence!C6","v":0},{"$f":"evidence!D6","v":0},1918,{"$f":"evidence!E6","v":0},{"$f":"evidence!L6","v":0},{"$f":"evidence!M6","v":0},{"$f":"evidence!N6","v":0},{"$f":"evidence!O6","v":0},{"$f":"evidence!P6","v":0},0,0,0,{"$f":"evidence!Q6","v":"00:00:00"},1900,2016,0,{"$f":"evidence!S6","v":0},"",null,{"$f":"evidence!F6","v":0},{"$f":"evidence!K6","v":0},null,null,null,0,0,0,0,0,0,0,0,0,0,0,0,0,0,0,0,0,0,0,0,0,null,null,null,null,null,0,0,0,0,0,"RODNE_CISLO",0,0,null,null,null,0,0,0,0,"","",0,0,0,0,0,0,null,null,null,null,null,null,null,null,null,null,null,null,null,null,null,null,null,null,null,null,null,null,null,null,null,null,null,null,null,"","","",null,null,"RODNE_CISLO","","",null,null,null,null,null,null,"","",null,null,"",null,"",null,null,null,""]
[{"$f":"evidence!A7","v":0},{"$f":"IF(ISTEXT(evidence!B7),evidence!B7,\"\")","v":""},{"$f":"evidence!C7","v":0},{"$f":"evidence!D7","v":0},1918,{"$f":"evidence!E7","v":0},{"$f":"evidence!L7","v":0},{"$f":"evidence!M7","v":0},{"$f":"evidence!N7","v":0},{"$f":"evidence!O7","v":0},{"$f":"evidence!P7","v":0},0,0,0,{"$f":"evidence!Q7","v":"00:00:00"},1900,2016,0,{"$f":"evidence!S7","v":0},"",null,{"$f":"evidence!F7","v":0},{"$f":"evidence!K7","v":0},null,null,null,0,0,0,0,0,0,0,0,0,0,0,0,0,0,0,0,0,0,0,0,0,null,null,null,null,null,0,0,0,0,0,"RODNE_CISLO",0,0,null,null,null,0,0,0,0,"","",0,0,0,0,0,0,null,null,null,null,null,null,null,null,null,null,null,null,null,null,null,null,null,null,null,null,null,null,null,null,null,null,null,null,null,"","","",null,null,"RODNE_CISLO","","",null,null,null,null,null,null,"","",null,null,"",null,"",null,null,null,""]
[{"$f":"evidence!A8","v":0},{"$f":"IF(ISTEXT(evidence!B8),evidence!B8,\"\")","v":""},{"$f":"evidence!C8","v":0},{"$f":"evidence!D8","v":0},1918,{"$f":"evidence!E8","v":0},{"$f":"evidence!L8","v":0},{"$f":"evidence!M8","v":0},{"$f":"evidence!N8","v":0},{"$f":"evidence!O8","v":0},{"$f":"evidence!P8","v":0},0,0,0,{"$f":"evidence!Q8","v":"00:00:00"},1900,2016,0,{"$f":"evidence!S8","v":0},"",null,{"$f":"evidence!F8","v":0},{"$f":"evidence!K8","v":0},null,null,null,0,0,0,0,0,0,0,0,0,0,0,0,0,0,0,0,0,0,0,0,0,null,null,null,null,null,0,0,0,0,0,"RODNE_CISLO",0,0,null,null,null,0,0,0,0,"","",0,0,0,0,0,0,null,null,null,null,null,null,null,null,null,null,null,null,null,null,null,null,null,null,null,null,null,null,null,null,null,null,null,null,null,"","","",null,null,"RODNE_CISLO","","",null,null,null,null,null,null,"","",null,null,"",null,"",null,null,null,""]
[{"$f":"evidence!A9","v":0},{"$f":"IF(ISTEXT(evidence!B9),evidence!B9,\"\")","v":""},{"$f":"evidence!C9","v":0},{"$f":"evidence!D9","v":0},1918,{"$f":"evidence!E9","v":0},{"$f":"evidence!L9","v":0},{"$f":"evidence!M9","v":0},{"$f":"evidence!N9","v":0},{"$f":"evidence!O9","v":0},{"$f":"evidence!P9","v":0},0,0,0,{"$f":"evidence!Q9","v":"00:00:00"},1900,2016,0,{"$f":"evidence!S9","v":0},"",null,{"$f":"evidence!F9","v":0},{"$f":"evidence!K9","v":0},null,null,null,0,0,0,0,0,0,0,0,0,0,0,0,0,0,0,0,0,0,0,0,0,null,null,null,null,null,0,0,0,0,0,"RODNE_CISLO",0,0,null,null,null,0,0,0,0,"","",0,0,0,0,0,0,null,null,null,null,null,null,null,null,null,null,null,null,null,null,null,null,null,null,null,null,null,null,null,null,null,null,null,null,null,"","","",null,null,"RODNE_CISLO","","",null,null,null,null,null,null,"","",null,null,"",null,"",null,null,null,""]
[{"$f":"evidence!A10","v":0},{"$f":"IF(ISTEXT(evidence!B10),evidence!B10,\"\")","v":""},{"$f":"evidence!C10","v":0},{"$f":"evidence!D10","v":0},1918,{"$f":"evidence!E10","v":0},{"$f":"evidence!L10","v":0},{"$f":"evidence!M10","v":0},{"$f":"evidence!N10","v":0},{"$f":"evidence!O10","v":0},{"$f":"evidence!P10","v":0},0,0,0,{"$f":"evidence!Q10","v":"00:00:00"},1900,2016,0,{"$f":"evidence!S10","v":0},"",null,{"$f":"evidence!F10","v":0},{"$f":"evidence!K10","v":0},null,null,null,0,0,0,0,0,0,0,0,0,0,0,0,0,0,0,0,0,0,0,0,0,null,null,null,null,null,0,0,0,0,0,"RODNE_CISLO",0,0,null,null,null,0,0,0,0,"","",0,0,0,0,0,0,null,null,null,null,null,null,null,null,null,null,null,null,null,null,null,null,null,null,null,null,null,null,null,null,null,null,null,null,null,"","","",null,null,"RODNE_CISLO","","",null,null,null,null,null,null,"","",null,null,"",null,"",null,null,null,""]
[{"$f":"evidence!A11","v":0},{"$f":"IF(ISTEXT(evidence!B11),evidence!B11,\"\")","v":""},{"$f":"evidence!C11","v":0},{"$f":"evidence!D11","v":0},1918,{"$f":"evidence!E11","v":0},{"$f":"evidence!L11","v":0},{"$f":"evidence!M11","v":0},{"$f":"evidence!N11","v":0},{"$f":"evidence!O11","v":0},{"$f":"evidence!P11","v":0},0,0,0,{"$f":"evidence!Q11","v":"00:00:00"},1900,2016,0,{"$f":"evidence!S11","v":0},"",null,{"$f":"evidence!F11","v":0},{"$f":"evidence!K11","v":0},null,null,null,0,0,0,0,0,0,0,0,0,0,0,0,0,0,0,0,0,0,0,0,0,null,null,null,null,null,0,0,0,0,0,"RODNE_CISLO",0,0,null,null,null,0,0,0,0,"","",0,0,0,0,0,0,null,null,null,null,null,null,null,null,null,null,null,null,null,null,null,null,null,null,null,null,null,null,null,null,null,null,null,null,null,"","","",null,null,"RODNE_CISLO","","",null,null,null,null,null,null,"","",null,null,"",null,"",null,null,null,""]
[{"$f":"evidence!A12","v":0},{"$f":"IF(ISTEXT(evidence!B12),evidence!B12,\"\")","v":""},{"$f":"evidence!C12","v":0},{"$f":"evidence!D12","v":0},1918,{"$f":"evidence!E12","v":0},{"$f":"evidence!L12","v":0},{"$f":"evidence!M12","v":0},{"$f":"evidence!N12","v":0},{"$f":"evidence!O12","v":0},{"$f":"evidence!P12","v":0},0,0,0,{"$f":"evidence!Q12","v":"00:00:00"},1900,2016,0,{"$f":"evidence!S12","v":0},"",null,{"$f":"evidence!F12","v":0},{"$f":"evidence!K12","v":0},null,null,null,0,0,0,0,0,0,0,0,0,0,0,0,0,0,0,0,0,0,0,0,0,null,null,null,null,null,0,0,0,0,0,"RODNE_CISLO",0,0,null,null,null,0,0,0,0,"","",0,0,0,0,0,0,null,null,null,null,null,null,null,null,null,null,null,null,null,null,null,null,null,null,null,null,null,null,null,null,null,null,null,null,null,"","","",null,null,"RODNE_CISLO","","",null,null,null,null,null,null,"","",null,null,"",null,"",null,null,null,""]
[{"$f":"evidence!A13","v":0},{"$f":"IF(ISTEXT(evidence!B13),evidence!B13,\"\")","v":""},{"$f":"evidence!C13","v":0},{"$f":"evidence!D13","v":0},1918,{"$f":"evidence!E13","v":0},{"$f":"evidence!L13","v":0},{"$f":"evidence!M13","v":0},{"$f":"evidence!N13","v":0},{"$f":"evidence!O13","v":0},{"$f":"evidence!P13","v":0},0,0,0,{"$f":"evidence!Q13","v":"00:00:00"},1900,2016,0,{"$f":"evidence!S13","v":0},"",null,{"$f":"evidence!F13","v":0},{"$f":"evidence!K13","v":0},null,null,null,0,0,0,0,0,0,0,0,0,0,0,0,0,0,0,0,0,0,0,0,0,null,null,null,null,null,0,0,0,0,0,"RODNE_CISLO",0,0,null,null,null,0,0,0,0,"","",0,0,0,0,0,0,null,null,null,null,null,null,null,null,null,null,null,null,null,null,null,null,null,null,null,null,null,null,null,null,null,null,null,null,null,"","","",null,null,"RODNE_CISLO","","",null,null,null,null,null,null,"","",null,null,"",null,"",null,null,null,""]
[{"$f":"evidence!A14","v":0},{"$f":"IF(ISTEXT(evidence!B14),evidence!B14,\"\")","v":""},{"$f":"evidence!C14","v":0},{"$f":"evidence!D14","v":0},1918,{"$f":"evidence!E14","v":0},{"$f":"evidence!L14","v":0},{"$f":"evidence!M14","v":0},{"$f":"evidence!N14","v":0},{"$f":"evidence!O14","v":0},{"$f":"evidence!P14","v":0},0,0,0,{"$f":"evidence!Q14","v":"00:00:00"},1900,2016,0,{"$f":"evidence!S14","v":0},"",null,{"$f":"evidence!F14","v":0},{"$f":"evidence!K14","v":0},null,null,null,0,0,0,0,0,0,0,0,0,0,0,0,0,0,0,0,0,0,0,0,0,null,null,null,null,null,0,0,0,0,0,"RODNE_CISLO",0,0,null,null,null,0,0,0,0,"","",0,0,0,0,0,0,null,null,null,null,null,null,null,null,null,null,null,null,null,null,null,null,null,null,null,null,null,null,null,null,null,null,null,null,null,"","","",null,null,"RODNE_CISLO","","",null,null,null,null,null,null,"","",null,null,"",null,"",null,null,null,""]
[{"$f":"evidence!A15","v":0},{"$f":"IF(ISTEXT(evidence!B15),evidence!B15,\"\")","v":""},{"$f":"evidence!C15","v":0},{"$f":"evidence!D15","v":0},1918,{"$f":"evidence!E15","v":0},{"$f":"evidence!L15","v":0},{"$f":"evidence!M15","v":0},{"$f":"evidence!N15","v":0},{"$f":"evidence!O15","v":0},{"$f":"evidence!P15","v":0},0,0,0,{"$f":"evidence!Q15","v":"00:00:00"},1900,2016,0,{"$f":"evidence!S15","v":0},"",null,{"$f":"evidence!F15","v":0},{"$f":"evidence!K15","v":0},null,null,null,0,0,0,0,0,0,0,0,0,0,0,0,0,0,0,0,0,0,0,0,0,null,null,null,null,null,0,0,0,0,0,"RODNE_CISLO",0,0,null,null,null,0,0,0,0,"","",0,0,0,0,0,0,null,null,null,null,null,null,null,null,null,null,null,null,null,null,null,null,null,null,null,null,null,null,null,null,null,null,null,null,null,"","","",null,null,"RODNE_CISLO","","",null,null,null,null,null,null,"","",null,null,"",null,"",null,null,null,""]
[{"$f":"evidence!A16","v":0},{"$f":"IF(ISTEXT(evidence!B16),evidence!B16,\"\")","v":""},{"$f":"evidence!C16","v":0},{"$f":"evidence!D16","v":0},1918,{"$f":"evidence!E16","v":0},{"$f":"evidence!L16","v":0},{"$f":"evidence!M16","v":0},{"$f":"evidence!N16","v":0},{"$f":"evidence!O16","v":0},{"$f":"evidence!P16","v":0},0,0,0,{"$f":"evidence!Q16","v":"00:00:00"},1900,2016,0,{"$f":"evidence!S16","v":0},"",null,{"$f":"evidence!F16","v":0},{"$f":"evidence!K16","v":0},null,null,null,0,0,0,0,0,0,0,0,0,0,0,0,0,0,0,0,0,0,0,0,0,null,null,null,null,null,0,0,0,0,0,"RODNE_CISLO",0,0,null,null,null,0,0,0,0,"","",0,0,0,0,0,0,null,null,null,null,null,null,null,null,null,null,null,null,null,null,null,null,null,null,null,null,null,null,null,null,null,null,null,null,null,"","","",null,null,"RODNE_CISLO","","",null,null,null,null,null,null,"","",null,null,"",null,"",null,null,null,""]
[{"$f":"evidence!A17","v":0},{"$f":"IF(ISTEXT(evidence!B17),evidence!B17,\"\")","v":""},{"$f":"evidence!C17","v":0},{"$f":"evidence!D17","v":0},1918,{"$f":"evidence!E17","v":0},{"$f":"evidence!L17","v":0},{"$f":"evidence!M17","v":0},{"$f":"evidence!N17","v":0},{"$f":"evidence!O17","v":0},{"$f":"evidence!P17","v":0},0,0,0,{"$f":"evidence!Q17","v":"00:00:00"},1900,2016,0,{"$f":"evidence!S17","v":0},"",null,{"$f":"evidence!F17","v":0},{"$f":"evidence!K17","v":0},null,null,null,0,0,0,0,0,0,0,0,0,0,0,0,0,0,0,0,0,0,0,0,0,null,null,null,null,null,0,0,0,0,0,"RODNE_CISLO",0,0,null,null,null,0,0,0,0,"","",0,0,0,0,0,0,null,null,null,null,null,null,null,null,null,null,null,null,null,null,null,null,null,null,null,null,null,null,null,null,null,null,null,null,null,"","","",null,null,"RODNE_CISLO","","",null,null,null,null,null,null,"","",null,null,"",null,"",null,null,null,""]
[{"$f":"evidence!A18","v":0},{"$f":"IF(ISTEXT(evidence!B18),evidence!B18,\"\")","v":""},{"$f":"evidence!C18","v":0},{"$f":"evidence!D18","v":0},1918,{"$f":"evidence!E18","v":0},{"$f":"evidence!L18","v":0},{"$f":"evidence!M18","v":0},{"$f":"evidence!N18","v":0},{"$f":"evidence!O18","v":0},{"$f":"evidence!P18","v":0},0,0,0,{"$f":"evidence!Q18","v":"00:00:00"},1900,2016,0,{"$f":"evidence!S18","v":0},"",null,{"$f":"evidence!F18","v":0},{"$f":"evidence!K18","v":0},null,null,null,0,0,0,0,0,0,0,0,0,0,0,0,0,0,0,0,0,0,0,0,0,null,null,null,null,null,0,0,0,0,0,"RODNE_CISLO",0,0,null,null,null,0,0,0,0,"","",0,0,0,0,0,0,null,null,null,null,null,null,null,null,null,null,null,null,null,null,null,null,null,null,null,null,null,null,null,null,null,null,null,null,null,"","","",null,null,"RODNE_CISLO","","",null,null,null,null,null,null,"","",null,null,"",null,"",null,null,null,""]
[{"$f":"evidence!A19","v":0},{"$f":"IF(ISTEXT(evidence!B19),evidence!B19,\"\")","v":""},{"$f":"evidence!C19","v":0},{"$f":"evidence!D19","v":0},1918,{"$f":"evidence!E19","v":0},{"$f":"evidence!L19","v":0},{"$f":"evidence!M19","v":0},{"$f":"evidence!N19","v":0},{"$f":"evidence!O19","v":0},{"$f":"evidence!P19","v":0},0,0,0,{"$f":"evidence!Q19","v":"00:00:00"},1900,2016,0,{"$f":"evidence!S19","v":0},"",null,{"$f":"evidence!F19","v":0},{"$f":"evidence!K19","v":0},null,null,null,0,0,0,0,0,0,0,0,0,0,0,0,0,0,0,0,0,0,0,0,0,null,null,null,null,null,0,0,0,0,0,"RODNE_CISLO",0,0,null,null,null,0,0,0,0,"","",0,0,0,0,0,0,null,null,null,null,null,null,null,null,null,null,null,null,null,null,null,null,null,null,null,null,null,null,null,null,null,null,null,null,null,"","","",null,null,"RODNE_CISLO","","",null,null,null,null,null,null,"","",null,null,"",null,"",null,null,null,""]
[{"$f":"evidence!A20","v":0},{"$f":"IF(ISTEXT(evidence!B20),evidence!B20,\"\")","v":""},{"$f":"evidence!C20","v":0},{"$f":"evidence!D20","v":0},1918,{"$f":"evidence!E20","v":0},{"$f":"evidence!L20","v":0},{"$f":"evidence!M20","v":0},{"$f":"evidence!N20","v":0},{"$f":"evidence!O20","v":0},{"$f":"evidence!P20","v":0},0,0,0,{"$f":"evidence!Q20","v":"00:00:00"},1900,2016,0,{"$f":"evidence!S20","v":0},"",null,{"$f":"evidence!F20","v":0},{"$f":"evidence!K20","v":0},null,null,null,0,0,0,0,0,0,0,0,0,0,0,0,0,0,0,0,0,0,0,0,0,null,null,null,null,null,0,0,0,0,0,"RODNE_CISLO",0,0,null,null,null,0,0,0,0,"","",0,0,0,0,0,0,null,null,null,null,null,null,null,null,null,null,null,null,null,null,null,null,null,null,null,null,null,null,null,null,null,null,null,null,null,"","","",null,null,"RODNE_CISLO","","",null,null,null,null,null,null,"","",null,null,"",null,"",null,null,null,""]
[{"$f":"evidence!A21","v":0},{"$f":"IF(ISTEXT(evidence!B21),evidence!B21,\"\")","v":""},{"$f":"evidence!C21","v":0},{"$f":"evidence!D21","v":0},1918,{"$f":"evidence!E21","v":0},{"$f":"evidence!L21","v":0},{"$f":"evidence!M21","v":0},{"$f":"evidence!N21","v":0},{"$f":"evidence!O21","v":0},{"$f":"evidence!P21","v":0},0,0,0,{"$f":"evidence!Q21","v":"00:00:00"},1900,2016,0,{"$f":"evidence!S21","v":0},"",null,{"$f":"evidence!F21","v":0},{"$f":"evidence!K21","v":0},null,null,null,0,0,0,0,0,0,0,0,0,0,0,0,0,0,0,0,0,0,0,0,0,null,null,null,null,null,0,0,0,0,0,"RODNE_CISLO",0,0,null,null,null,0,0,0,0,"","",0,0,0,0,0,0,null,null,null,null,null,null,null,null,null,null,null,null,null,null,null,null,null,null,null,null,null,null,null,null,null,null,null,null,null,"","","",null,null,"RODNE_CISLO","","",null,null,null,null,null,null,"","",null,null,"",null,"",null,null,null,""]
[{"$f":"evidence!A22","v":0},{"$f":"IF(ISTEXT(evidence!B22),evidence!B22,\"\")","v":""},{"$f":"evidence!C22","v":0},{"$f":"evidence!D22","v":0},1918,{"$f":"evidence!E22","v":0},{"$f":"evidence!L22","v":0},{"$f":"evidence!M22","v":0},{"$f":"evidence!N22","v":0},{"$f":"evidence!O22","v":0},{"$f":"evidence!P22","v":0},0,0,0,{"$f":"evidence!Q22","v":"00:00:00"},1900,2016,0,{"$f":"evidence!S22","v":0},"",null,{"$f":"evidence!F22","v":0},{"$f":"evidence!K22","v":0},null,null,null,0,0,0,0,0,0,0,0,0,0,0,0,0,0,0,0,0,0,0,0,0,null,null,null,null,null,0,0,0,0,0,"RODNE_CISLO",0,0,null,null,null,0,0,0,0,"","",0,0,0,0,0,0,null,null,null,null,null,null,null,null,null,null,null,null,null,null,null,null,null,null,null,null,null,null,null,null,null,null,null,null,null,"","","",null,null,"RODNE_CISLO","","",null,null,null,null,null,null,"","",null,null,"",null,"",null,null,null,""]
[{"$f":"evidence!A23","v":0},{"$f":"IF(ISTEXT(evidence!B23),evidence!B23,\"\")","v":""},{"$f":"evidence!C23","v":0},{"$f":"evidence!D23","v":0},1918,{"$f":"evidence!E23","v":0},{"$f":"evidence!L23","v":0},{"$f":"evidence!M23","v":0},{"$f":"evidence!N23","v":0},{"$f":"evidence!O23","v":0},{"$f":"evidence!P23","v":0},0,0,0,{"$f":"evidence!Q23","v":"00:00:00"},1900,2016,0,{"$f":"evidence!S23","v":0},"",null,{"$f":"evidence!F23","v":0},{"$f":"evidence!K23","v":0},null,null,null,0,0,0,0,0,0,0,0,0,0,0,0,0,0,0,0,0,0,0,0,0,null,null,null,null,null,0,0,0,0,0,"RODNE_CISLO",0,0,null,null,null,0,0,0,0,"","",0,0,0,0,0,0,null,null,null,null,null,null,null,null,null,null,null,null,null,null,null,null,null,null,null,null,null,null,null,null,null,null,null,null,null,"","","",null,null,"RODNE_CISLO","","",null,null,null,null,null,null,"","",null,null,"",null,"",null,null,null,""]
[{"$f":"evidence!A24","v":0},{"$f":"IF(ISTEXT(evidence!B24),evidence!B24,\"\")","v":""},{"$f":"evidence!C24","v":0},{"$f":"evidence!D24","v":0},1918,{"$f":"evidence!E24","v":0},{"$f":"evidence!L24","v":0},{"$f":"evidence!M24","v":0},{"$f":"evidence!N24","v":0},{"$f":"evidence!O24","v":0},{"$f":"evidence!P24","v":0},0,0,0,{"$f":"evidence!Q24","v":"00:00:00"},1900,2016,0,{"$f":"evidence!S24","v":0},"",null,{"$f":"evidence!F24","v":0},{"$f":"evidence!K24","v":0},null,null,null,0,0,0,0,0,0,0,0,0,0,0,0,0,0,0,0,0,0,0,0,0,null,null,null,null,null,0,0,0,0,0,"RODNE_CISLO",0,0,null,null,null,0,0,0,0,"","",0,0,0,0,0,0,null,null,null,null,null,null,null,null,null,null,null,null,null,null,null,null,null,null,null,null,null,null,null,null,null,null,null,null,null,"","","",null,null,"RODNE_CISLO","","",null,null,null,null,null,null,"","",null,null,"",null,"",null,null,null,""]
[{"$f":"evidence!A25","v":0},{"$f":"IF(ISTEXT(evidence!B25),evidence!B25,\"\")","v":""},{"$f":"evidence!C25","v":0},{"$f":"evidence!D25","v":0},1918,{"$f":"evidence!E25","v":0},{"$f":"evidence!L25","v":0},{"$f":"evidence!M25","v":0},{"$f":"evidence!N25","v":0},{"$f":"evidence!O25","v":0},{"$f":"evidence!P25","v":0},0,0,0,{"$f":"evidence!Q25","v":"00:00:00"},1900,2016,0,{"$f":"evidence!S25","v":0},"",null,{"$f":"evidence!F25","v":0},{"$f":"evidence!K25","v":0},null,null,null,0,0,0,0,0,0,0,0,0,0,0,0,0,0,0,0,0,0,0,0,0,null,null,null,null,null,0,0,0,0,0,"RODNE_CISLO",0,0,null,null,null,0,0,0,0,"","",0,0,0,0,0,0,null,null,null,null,null,null,null,null,null,null,null,null,null,null,null,null,null,null,null,null,null,null,null,null,null,null,null,null,null,"","","",null,null,"RODNE_CISLO","","",null,null,null,null,null,null,"","",null,null,"",null,"",null,null,null,""]
[{"$f":"evidence!A26","v":0},{"$f":"IF(ISTEXT(evidence!B26),evidence!B26,\"\")","v":""},{"$f":"evidence!C26","v":0},{"$f":"evidence!D26","v":0},1918,{"$f":"evidence!E26","v":0},{"$f":"evidence!L26","v":0},{"$f":"evidence!M26","v":0},{"$f":"evidence!N26","v":0},{"$f":"evidence!O26","v":0},{"$f":"evidence!P26","v":0},0,0,0,{"$f":"evidence!Q26","v":"00:00:00"},1900,2016,0,{"$f":"evidence!S26","v":0},"",null,{"$f":"evidence!F26","v":0},{"$f":"evidence!K26","v":0},null,null,null,0,0,0,0,0,0,0,0,0,0,0,0,0,0,0,0,0,0,0,0,0,null,null,null,null,null,0,0,0,0,0,"RODNE_CISLO",0,0,null,null,null,0,0,0,0,"","",0,0,0,0,0,0,null,null,null,null,null,null,null,null,null,null,null,null,null,null,null,null,null,null,null,null,null,null,null,null,null,null,null,null,null,"","","",null,null,"RODNE_CISLO","","",null,null,null,null,null,null,"","",null,null,"",null,"",null,null,null,""]
[{"$f":"evidence!A27","v":0},{"$f":"IF(ISTEXT(evidence!B27),evidence!B27,\"\")","v":""},{"$f":"evidence!C27","v":0},{"$f":"evidence!D27","v":0},1918,{"$f":"evidence!E27","v":0},{"$f":"evidence!L27","v":0},{"$f":"evidence!M27","v":0},{"$f":"evidence!N27","v":0},{"$f":"evidence!O27","v":0},{"$f":"evidence!P27","v":0},0,0,0,{"$f":"evidence!Q27","v":"00:00:00"},1900,2016,0,{"$f":"evidence!S27","v":0},"",null,{"$f":"evidence!F27","v":0},{"$f":"evidence!K27","v":0},null,null,null,0,0,0,0,0,0,0,0,0,0,0,0,0,0,0,0,0,0,0,0,0,null,null,null,null,null,0,0,0,0,0,"RODNE_CISLO",0,0,null,null,null,0,0,0,0,"","",0,0,0,0,0,0,null,null,null,null,null,null,null,null,null,null,null,null,null,null,null,null,null,null,null,null,null,null,null,null,null,null,null,null,null,"","","",null,null,"RODNE_CISLO","","",null,null,null,null,null,null,"","",null,null,"",null,"",null,null,null,""]
[{"$f":"evidence!A28","v":0},{"$f":"IF(ISTEXT(evidence!B28),evidence!B28,\"\")","v":""},{"$f":"evidence!C28","v":0},{"$f":"evidence!D28","v":0},1918,{"$f":"evidence!E28","v":0},{"$f":"evidence!L28","v":0},{"$f":"evidence!M28","v":0},{"$f":"evidence!N28","v":0},{"$f":"evidence!O28","v":0},{"$f":"evidence!P28","v":0},0,0,0,{"$f":"evidence!Q28","v":"00:00:00"},1900,2016,0,{"$f":"evidence!S28","v":0},"",null,{"$f":"evidence!F28","v":0},{"$f":"evidence!K28","v":0},null,null,null,0,0,0,0,0,0,0,0,0,0,0,0,0,0,0,0,0,0,0,0,0,null,null,null,null,null,0,0,0,0,0,"RODNE_CISLO",0,0,null,null,null,0,0,0,0,"","",0,0,0,0,0,0,null,null,null,null,null,null,null,null,null,null,null,null,null,null,null,null,null,null,null,null,null,null,null,null,null,null,null,null,null,"","","",null,null,"RODNE_CISLO","","",null,null,null,null,null,null,"","",null,null,"",null,"",null,null,null,""]
[{"$f":"evidence!A29","v":0},{"$f":"IF(ISTEXT(evidence!B29),evidence!B29,\"\")","v":""},{"$f":"evidence!C29","v":0},{"$f":"evidence!D29","v":0},1918,{"$f":"evidence!E29","v":0},{"$f":"evidence!L29","v":0},{"$f":"evidence!M29","v":0},{"$f":"evidence!N29","v":0},{"$f":"evidence!O29","v":0},{"$f":"evidence!P29","v":0},0,0,0,{"$f":"evidence!Q29","v":"00:00:00"},1900,2016,0,{"$f":"evidence!S29","v":0},"",null,{"$f":"evidence!F29","v":0},{"$f":"evidence!K29","v":0},null,null,null,0,0,0,0,0,0,0,0,0,0,0,0,0,0,0,0,0,0,0,0,0,null,null,null,null,null,0,0,0,0,0,"RODNE_CISLO",0,0,null,null,null,0,0,0,0,"","",0,0,0,0,0,0,null,null,null,null,null,null,null,null,null,null,null,null,null,null,null,null,null,null,null,null,null,null,null,null,null,null,null,null,null,"","","",null,null,"RODNE_CISLO","","",null,null,null,null,null,null,"","",null,null,"",null,"",null,null,null,""]
[{"$f":"evidence!A30","v":0},{"$f":"IF(ISTEXT(evidence!B30),evidence!B30,\"\")","v":""},{"$f":"evidence!C30","v":0},{"$f":"evidence!D30","v":0},1918,{"$f":"evidence!E30","v":0},{"$f":"evidence!L30","v":0},{"$f":"evidence!M30","v":0},{"$f":"evidence!N30","v":0},{"$f":"evidence!O30","v":0},{"$f":"evidence!P30","v":0},0,0,0,{"$f":"evidence!Q30","v":"00:00:00"},1900,2016,0,{"$f":"evidence!S30","v":0},"",null,{"$f":"evidence!F30","v":0},{"$f":"evidence!K30","v":0},null,null,null,0,0,0,0,0,0,0,0,0,0,0,0,0,0,0,0,0,0,0,0,0,null,null,null,null,null,0,0,0,0,0,"RODNE_CISLO",0,0,null,null,null,0,0,0,0,"","",0,0,0,0,0,0,null,null,null,null,null,null,null,null,null,null,null,null,null,null,null,null,null,null,null,null,null,null,null,null,null,null,null,null,null,"","","",null,null,"RODNE_CISLO","","",null,null,null,null,null,null,"","",null,null,"",null,"",null,null,null,""]
[{"$f":"evidence!A31","v":0},{"$f":"IF(ISTEXT(evidence!B31),evidence!B31,\"\")","v":""},{"$f":"evidence!C31","v":0},{"$f":"evidence!D31","v":0},1918,{"$f":"evidence!E31","v":0},{"$f":"evidence!L31","v":0},{"$f":"evidence!M31","v":0},{"$f":"evidence!N31","v":0},{"$f":"evidence!O31","v":0},{"$f":"evidence!P31","v":0},0,0,0,{"$f":"evidence!Q31","v":"00:00:00"},1900,2016,0,{"$f":"evidence!S31","v":0},"",null,{"$f":"evidence!F31","v":0},{"$f":"evidence!K31","v":0},null,null,null,0,0,0,0,0,0,0,0,0,0,0,0,0,0,0,0,0,0,0,0,0,null,null,null,null,null,0,0,0,0,0,"RODNE_CISLO",0,0,null,null,null,0,0,0,0,"","",0,0,0,0,0,0,null,null,null,null,null,null,null,null,null,null,null,null,null,null,null,null,null,null,null,null,null,null,null,null,null,null,null,null,null,"","","",null,null,"RODNE_CISLO","","",null,null,null,null,null,null,"","",null,null,"",null,"",null,null,null,""]
[{"$f":"evidence!A32","v":0},{"$f":"IF(ISTEXT(evidence!B32),evidence!B32,\"\")","v":""},{"$f":"evidence!C32","v":0},{"$f":"evidence!D32","v":0},1918,{"$f":"evidence!E32","v":0},{"$f":"evidence!L32","v":0},{"$f":"evidence!M32","v":0},{"$f":"evidence!N32","v":0},{"$f":"evidence!O32","v":0},{"$f":"evidence!P32","v":0},0,0,0,{"$f":"evidence!Q32","v":"00:00:00"},1900,2016,0,{"$f":"evidence!S32","v":0},"",null,{"$f":"evidence!F32","v":0},{"$f":"evidence!K32","v":0},null,null,null,0,0,0,0,0,0,0,0,0,0,0,0,0,0,0,0,0,0,0,0,0,null,null,null,null,null,0,0,0,0,0,"RODNE_CISLO",0,0,null,null,null,0,0,0,0,"","",0,0,0,0,0,0,null,null,null,null,null,null,null,null,null,null,null,null,null,null,null,null,null,null,null,null,null,null,null,null,null,null,null,null,null,"","","",null,null,"RODNE_CISLO","","",null,null,null,null,null,null,"","",null,null,"",null,"",null,null,null,""]
[{"$f":"evidence!A33","v":0},{"$f":"IF(ISTEXT(evidence!B33),evidence!B33,\"\")","v":""},{"$f":"evidence!C33","v":0},{"$f":"evidence!D33","v":0},1918,{"$f":"evidence!E33","v":0},{"$f":"evidence!L33","v":0},{"$f":"evidence!M33","v":0},{"$f":"evidence!N33","v":0},{"$f":"evidence!O33","v":0},{"$f":"evidence!P33","v":0},0,0,0,{"$f":"evidence!Q33","v":"00:00:00"},1900,2016,0,{"$f":"evidence!S33","v":0},"",null,{"$f":"evidence!F33","v":0},{"$f":"evidence!K33","v":0},null,null,null,0,0,0,0,0,0,0,0,0,0,0,0,0,0,0,0,0,0,0,0,0,null,null,null,null,null,0,0,0,0,0,"RODNE_CISLO",0,0,null,null,null,0,0,0,0,"","",0,0,0,0,0,0,null,null,null,null,null,null,null,null,null,null,null,null,null,null,null,null,null,null,null,null,null,null,null,null,null,null,null,null,null,"","","",null,null,"RODNE_CISLO","","",null,null,null,null,null,null,"","",null,null,"",null,"",null,null,null,""]
[{"$f":"evidence!A34","v":0},{"$f":"IF(ISTEXT(evidence!B34),evidence!B34,\"\")","v":""},{"$f":"evidence!C34","v":0},{"$f":"evidence!D34","v":0},1918,{"$f":"evidence!E34","v":0},{"$f":"evidence!L34","v":0},{"$f":"evidence!M34","v":0},{"$f":"evidence!N34","v":0},{"$f":"evidence!O34","v":0},{"$f":"evidence!P34","v":0},0,0,0,{"$f":"evidence!Q34","v":"00:00:00"},1900,2016,0,{"$f":"evidence!S34","v":0},"",null,{"$f":"evidence!F34","v":0},{"$f":"evidence!K34","v":0},null,null,null,0,0,0,0,0,0,0,0,0,0,0,0,0,0,0,0,0,0,0,0,0,null,null,null,null,null,0,0,0,0,0,"RODNE_CISLO",0,0,null,null,null,0,0,0,0,"","",0,0,0,0,0,0,null,null,null,null,null,null,null,null,null,null,null,null,null,null,null,null,null,null,null,null,null,null,null,null,null,null,null,null,null,"","","",null,null,"RODNE_CISLO","","",null,null,null,null,null,null,"","",null,null,"",null,"",null,null,null,""]
[{"$f":"evidence!A35","v":0},{"$f":"IF(ISTEXT(evidence!B35),evidence!B35,\"\")","v":""},{"$f":"evidence!C35","v":0},{"$f":"evidence!D35","v":0},1918,{"$f":"evidence!E35","v":0},{"$f":"evidence!L35","v":0},{"$f":"evidence!M35","v":0},{"$f":"evidence!N35","v":0},{"$f":"evidence!O35","v":0},{"$f":"evidence!P35","v":0},0,0,0,{"$f":"evidence!Q35","v":"00:00:00"},1900,2016,0,{"$f":"evidence!S35","v":0},"",null,{"$f":"evidence!F35","v":0},{"$f":"evidence!K35","v":0},null,null,null,0,0,0,0,0,0,0,0,0,0,0,0,0,0,0,0,0,0,0,0,0,null,null,null,null,null,0,0,0,0,0,"RODNE_CISLO",0,0,null,null,null,0,0,0,0,"","",0,0,0,0,0,0,null,null,null,null,null,null,null,null,null,null,null,null,null,null,null,null,null,null,null,null,null,null,null,null,null,null,null,null,null,"","","",null,null,"RODNE_CISLO","","",null,null,null,null,null,null,"","",null,null,"",null,"",null,null,null,""]
[{"$f":"evidence!A36","v":0},{"$f":"IF(ISTEXT(evidence!B36),evidence!B36,\"\")","v":""},{"$f":"evidence!C36","v":0},{"$f":"evidence!D36","v":0},1918,{"$f":"evidence!E36","v":0},{"$f":"evidence!L36","v":0},{"$f":"evidence!M36","v":0},{"$f":"evidence!N36","v":0},{"$f":"evidence!O36","v":0},{"$f":"evidence!P36","v":0},0,0,0,{"$f":"evidence!Q36","v":"00:00:00"},1900,2016,0,{"$f":"evidence!S36","v":0},"",null,{"$f":"evidence!F36","v":0},{"$f":"evidence!K36","v":0},null,null,null,0,0,0,0,0,0,0,0,0,0,0,0,0,0,0,0,0,0,0,0,0,null,null,null,null,null,0,0,0,0,0,"RODNE_CISLO",0,0,null,null,null,0,0,0,0,"","",0,0,0,0,0,0,null,null,null,null,null,null,null,null,null,null,null,null,null,null,null,null,null,null,null,null,null,null,null,null,null,null,null,null,null,"","","",null,null,"RODNE_CISLO","","",null,null,null,null,null,null,"","",null,null,"",null,"",null,null,null,""]
[{"$f":"evidence!A37","v":0},{"$f":"IF(ISTEXT(evidence!B37),evidence!B37,\"\")","v":""},{"$f":"evidence!C37","v":0},{"$f":"evidence!D37","v":0},1918,{"$f":"evidence!E37","v":0},{"$f":"evidence!L37","v":0},{"$f":"evidence!M37","v":0},{"$f":"evidence!N37","v":0},{"$f":"evidence!O37","v":0},{"$f":"evidence!P37","v":0},0,0,0,{"$f":"evidence!Q37","v":"00:00:00"},1900,2016,0,{"$f":"evidence!S37","v":0},"",null,{"$f":"evidence!F37","v":0},{"$f":"evidence!K37","v":0},null,null,null,0,0,0,0,0,0,0,0,0,0,0,0,0,0,0,0,0,0,0,0,0,null,null,null,null,null,0,0,0,0,0,"RODNE_CISLO",0,0,null,null,null,0,0,0,0,"","",0,0,0,0,0,0,null,null,null,null,null,null,null,null,null,null,null,null,null,null,null,null,null,null,null,null,null,null,null,null,null,null,null,null,null,"","","",null,null,"RODNE_CISLO","","",null,null,null,null,null,null,"","",null,null,"",null,"",null,null,null,""]
[{"$f":"evidence!A38","v":0},{"$f":"IF(ISTEXT(evidence!B38),evidence!B38,\"\")","v":""},{"$f":"evidence!C38","v":0},{"$f":"evidence!D38","v":0},1918,{"$f":"evidence!E38","v":0},{"$f":"evidence!L38","v":0},{"$f":"evidence!M38","v":0},{"$f":"evidence!N38","v":0},{"$f":"evidence!O38","v":0},{"$f":"evidence!P38","v":0},0,0,0,{"$f":"evidence!Q38","v":"00:00:00"},1900,2016,0,{"$f":"evidence!S38","v":0},"",null,{"$f":"evidence!F38","v":0},{"$f":"evidence!K38","v":0},null,null,null,0,0,0,0,0,0,0,0,0,0,0,0,0,0,0,0,0,0,0,0,0,null,null,null,null,null,0,0,0,0,0,"RODNE_CISLO",0,0,null,null,null,0,0,0,0,"","",0,0,0,0,0,0,null,null,null,null,null,null,null,null,null,null,null,null,null,null,null,null,null,null,null,null,null,null,null,null,null,null,null,null,null,"","","",null,null,"RODNE_CISLO","","",null,null,null,null,null,null,"","",null,null,"",null,"",null,null,null,""]
[{"$f":"evidence!A39","v":0},{"$f":"IF(ISTEXT(evidence!B39),evidence!B39,\"\")","v":""},{"$f":"evidence!C39","v":0},{"$f":"evidence!D39","v":0},1918,{"$f":"evidence!E39","v":0},{"$f":"evidence!L39","v":0},{"$f":"evidence!M39","v":0},{"$f":"evidence!N39","v":0},{"$f":"evidence!O39","v":0},{"$f":"evidence!P39","v":0},0,0,0,{"$f":"evidence!Q39","v":"00:00:00"},1900,2016,0,{"$f":"evidence!S39","v":0},"",null,{"$f":"evidence!F39","v":0},{"$f":"evidence!K39","v":0},null,null,null,0,0,0,0,0,0,0,0,0,0,0,0,0,0,0,0,0,0,0,0,0,null,null,null,null,null,0,0,0,0,0,"RODNE_CISLO",0,0,null,null,null,0,0,0,0,"","",0,0,0,0,0,0,null,null,null,null,null,null,null,null,null,null,null,null,null,null,null,null,null,null,null,null,null,null,null,null,null,null,null,null,null,"","","",null,null,"RODNE_CISLO","","",null,null,null,null,null,null,"","",null,null,"",null,"",null,null,null,""]
[{"$f":"evidence!A40","v":0},{"$f":"IF(ISTEXT(evidence!B40),evidence!B40,\"\")","v":""},{"$f":"evidence!C40","v":0},{"$f":"evidence!D40","v":0},1918,{"$f":"evidence!E40","v":0},{"$f":"evidence!L40","v":0},{"$f":"evidence!M40","v":0},{"$f":"evidence!N40","v":0},{"$f":"evidence!O40","v":0},{"$f":"evidence!P40","v":0},0,0,0,{"$f":"evidence!Q40","v":"00:00:00"},1900,2016,0,{"$f":"evidence!S40","v":0},"",null,{"$f":"evidence!F40","v":0},{"$f":"evidence!K40","v":0},null,null,null,0,0,0,0,0,0,0,0,0,0,0,0,0,0,0,0,0,0,0,0,0,null,null,null,null,null,0,0,0,0,0,"RODNE_CISLO",0,0,null,null,null,0,0,0,0,"","",0,0,0,0,0,0,null,null,null,null,null,null,null,null,null,null,null,null,null,null,null,null,null,null,null,null,null,null,null,null,null,null,null,null,null,"","","",null,null,"RODNE_CISLO","","",null,null,null,null,null,null,"","",null,null,"",null,"",null,null,null,""]
[{"$f":"evidence!A41","v":0},{"$f":"IF(ISTEXT(evidence!B41),evidence!B41,\"\")","v":""},{"$f":"evidence!C41","v":0},{"$f":"evidence!D41","v":0},1918,{"$f":"evidence!E41","v":0},{"$f":"evidence!L41","v":0},{"$f":"evidence!M41","v":0},{"$f":"evidence!N41","v":0},{"$f":"evidence!O41","v":0},{"$f":"evidence!P41","v":0},0,0,0,{"$f":"evidence!Q41","v":"00:00:00"},1900,2016,0,{"$f":"evidence!S41","v":0},"",null,{"$f":"evidence!F41","v":0},{"$f":"evidence!K41","v":0},null,null,null,0,0,0,0,0,0,0,0,0,0,0,0,0,0,0,0,0,0,0,0,0,null,null,null,null,null,0,0,0,0,0,"RODNE_CISLO",0,0,null,null,null,0,0,0,0,"","",0,0,0,0,0,0,null,null,null,null,null,null,null,null,null,null,null,null,null,null,null,null,null,null,null,null,null,null,null,null,null,null,null,null,null,"","","",null,null,"RODNE_CISLO","","",null,null,null,null,null,null,"","",null,null,"",null,"",null,null,null,""]
[{"$f":"evidence!A42","v":0},{"$f":"IF(ISTEXT(evidence!B42),evidence!B42,\"\")","v":""},{"$f":"evidence!C42","v":0},{"$f":"evidence!D42","v":0},1918,{"$f":"evidence!E42","v":0},{"$f":"evidence!L42","v":0},{"$f":"evidence!M42","v":0},{"$f":"evidence!N42","v":0},{"$f":"evidence!O42","v":0},{"$f":"evidence!P42","v":0},0,0,0,{"$f":"evidence!Q42","v":"00:00:00"},1900,2016,0,{"$f":"evidence!S42","v":0},"",null,{"$f":"evidence!F42","v":0},{"$f":"evidence!K42","v":0},null,null,null,0,0,0,0,0,0,0,0,0,0,0,0,0,0,0,0,0,0,0,0,0,null,null,null,null,null,0,0,0,0,0,"RODNE_CISLO",0,0,null,null,null,0,0,0,0,"","",0,0,0,0,0,0,null,null,null,null,null,null,null,null,null,null,null,null,null,null,null,null,null,null,null,null,null,null,null,null,null,null,null,null,null,"","","",null,null,"RODNE_CISLO","","",null,null,null,null,null,null,"","",null,null,"",null,"",null,null,null,""]
[{"$f":"evidence!A43","v":0},{"$f":"IF(ISTEXT(evidence!B43),evidence!B43,\"\")","v":""},{"$f":"evidence!C43","v":0},{"$f":"evidence!D43","v":0},1918,{"$f":"evidence!E43","v":0},{"$f":"evidence!L43","v":0},{"$f":"evidence!M43","v":0},{"$f":"evidence!N43","v":0},{"$f":"evidence!O43","v":0},{"$f":"evidence!P43","v":0},0,0,0,{"$f":"evidence!Q43","v":"00:00:00"},1900,2016,0,{"$f":"evidence!S43","v":0},"",null,{"$f":"evidence!F43","v":0},{"$f":"evidence!K43","v":0},null,null,null,0,0,0,0,0,0,0,0,0,0,0,0,0,0,0,0,0,0,0,0,0,null,null,null,null,null,0,0,0,0,0,"RODNE_CISLO",0,0,null,null,null,0,0,0,0,"","",0,0,0,0,0,0,null,null,null,null,null,null,null,null,null,null,null,null,null,null,null,null,null,null,null,null,null,null,null,null,null,null,null,null,null,"","","",null,null,"RODNE_CISLO","","",null,null,null,null,null,null,"","",null,null,"",null,"",null,null,null,""]
[{"$f":"evidence!A44","v":0},{"$f":"IF(ISTEXT(evidence!B44),evidence!B44,\"\")","v":""},{"$f":"evidence!C44","v":0},{"$f":"evidence!D44","v":0},1918,{"$f":"evidence!E44","v":0},{"$f":"evidence!L44","v":0},{"$f":"evidence!M44","v":0},{"$f":"evidence!N44","v":0},{"$f":"evidence!O44","v":0},{"$f":"evidence!P44","v":0},0,0,0,{"$f":"evidence!Q44","v":"00:00:00"},1900,2016,0,{"$f":"evidence!S44","v":0},"",null,{"$f":"evidence!F44","v":0},{"$f":"evidence!K44","v":0},null,null,null,0,0,0,0,0,0,0,0,0,0,0,0,0,0,0,0,0,0,0,0,0,null,null,null,null,null,0,0,0,0,0,"RODNE_CISLO",0,0,null,null,null,0,0,0,0,"","",0,0,0,0,0,0,null,null,null,null,null,null,null,null,null,null,null,null,null,null,null,null,null,null,null,null,null,null,null,null,null,null,null,null,null,"","","",null,null,"RODNE_CISLO","","",null,null,null,null,null,null,"","",null,null,"",null,"",null,null,null,""]
[{"$f":"evidence!A45","v":0},{"$f":"IF(ISTEXT(evidence!B45),evidence!B45,\"\")","v":""},{"$f":"evidence!C45","v":0},{"$f":"evidence!D45","v":0},1918,{"$f":"evidence!E45","v":0},{"$f":"evidence!L45","v":0},{"$f":"evidence!M45","v":0},{"$f":"evidence!N45","v":0},{"$f":"evidence!O45","v":0},{"$f":"evidence!P45","v":0},0,0,0,{"$f":"evidence!Q45","v":"00:00:00"},1900,2016,0,{"$f":"evidence!S45","v":0},"",null,{"$f":"evidence!F45","v":0},{"$f":"evidence!K45","v":0},null,null,null,0,0,0,0,0,0,0,0,0,0,0,0,0,0,0,0,0,0,0,0,0,null,null,null,null,null,0,0,0,0,0,"RODNE_CISLO",0,0,null,null,null,0,0,0,0,"","",0,0,0,0,0,0,null,null,null,null,null,null,null,null,null,null,null,null,null,null,null,null,null,null,null,null,null,null,null,null,null,null,null,null,null,"","","",null,null,"RODNE_CISLO","","",null,null,null,null,null,null,"","",null,null,"",null,"",null,null,null,""]
[{"$f":"evidence!A46","v":0},{"$f":"IF(ISTEXT(evidence!B46),evidence!B46,\"\")","v":""},{"$f":"evidence!C46","v":0},{"$f":"evidence!D46","v":0},1918,{"$f":"evidence!E46","v":0},{"$f":"evidence!L46","v":0},{"$f":"evidence!M46","v":0},{"$f":"evidence!N46","v":0},{"$f":"evidence!O46","v":0},{"$f":"evidence!P46","v":0},0,0,0,{"$f":"evidence!Q46","v":"00:00:00"},1900,2016,0,{"$f":"evidence!S46","v":0},"",null,{"$f":"evidence!F46","v":0},{"$f":"evidence!K46","v":0},null,null,null,0,0,0,0,0,0,0,0,0,0,0,0,0,0,0,0,0,0,0,0,0,null,null,null,null,null,0,0,0,0,0,"RODNE_CISLO",0,0,null,null,null,0,0,0,0,"","",0,0,0,0,0,0,null,null,null,null,null,null,null,null,null,null,null,null,null,null,null,null,null,null,null,null,null,null,null,null,null,null,null,null,null,"","","",null,null,"RODNE_CISLO","","",null,null,null,null,null,null,"","",null,null,"",null,"",null,null,null,""]
[{"$f":"evidence!A47","v":0},{"$f":"IF(ISTEXT(evidence!B47),evidence!B47,\"\")","v":""},{"$f":"evidence!C47","v":0},{"$f":"evidence!D47","v":0},1918,{"$f":"evidence!E47","v":0},{"$f":"evidence!L47","v":0},{"$f":"evidence!M47","v":0},{"$f":"evidence!N47","v":0},{"$f":"evidence!O47","v":0},{"$f":"evidence!P47","v":0},0,0,0,{"$f":"evidence!Q47","v":"00:00:00"},1900,2016,0,{"$f":"evidence!S47","v":0},"",null,{"$f":"evidence!F47","v":0},{"$f":"evidence!K47","v":0},null,null,null,0,0,0,0,0,0,0,0,0,0,0,0,0,0,0,0,0,0,0,0,0,null,null,null,null,null,0,0,0,0,0,"RODNE_CISLO",0,0,null,null,null,0,0,0,0,"","",0,0,0,0,0,0,null,null,null,null,null,null,null,null,null,null,null,null,null,null,null,null,null,null,null,null,null,null,null,null,null,null,null,null,null,"","","",null,null,"RODNE_CISLO","","",null,null,null,null,null,null,"","",null,null,"",null,"",null,null,null,""]
[{"$f":"evidence!A48","v":0},{"$f":"IF(ISTEXT(evidence!B48),evidence!B48,\"\")","v":""},{"$f":"evidence!C48","v":0},{"$f":"evidence!D48","v":0},1918,{"$f":"evidence!E48","v":0},{"$f":"evidence!L48","v":0},{"$f":"evidence!M48","v":0},{"$f":"evidence!N48","v":0},{"$f":"evidence!O48","v":0},{"$f":"evidence!P48","v":0},0,0,0,{"$f":"evidence!Q48","v":"00:00:00"},1900,2016,0,{"$f":"evidence!S48","v":0},"",null,{"$f":"evidence!F48","v":0},{"$f":"evidence!K48","v":0},null,null,null,0,0,0,0,0,0,0,0,0,0,0,0,0,0,0,0,0,0,0,0,0,null,null,null,null,null,0,0,0,0,0,"RODNE_CISLO",0,0,null,null,null,0,0,0,0,"","",0,0,0,0,0,0,null,null,null,null,null,null,null,null,null,null,null,null,null,null,null,null,null,null,null,null,null,null,null,null,null,null,null,null,null,"","","",null,null,"RODNE_CISLO","","",null,null,null,null,null,null,"","",null,null,"",null,"",null,null,null,""]
[{"$f":"evidence!A49","v":0},{"$f":"IF(ISTEXT(evidence!B49),evidence!B49,\"\")","v":""},{"$f":"evidence!C49","v":0},{"$f":"evidence!D49","v":0},1918,{"$f":"evidence!E49","v":0},{"$f":"evidence!L49","v":0},{"$f":"evidence!M49","v":0},{"$f":"evidence!N49","v":0},{"$f":"evidence!O49","v":0},{"$f":"evidence!P49","v":0},0,0,0,{"$f":"evidence!Q49","v":"00:00:00"},1900,2016,0,{"$f":"evidence!S49","v":0},"",null,{"$f":"evidence!F49","v":0},{"$f":"evidence!K49","v":0},null,null,null,0,0,0,0,0,0,0,0,0,0,0,0,0,0,0,0,0,0,0,0,0,null,null,null,null,null,0,0,0,0,0,"RODNE_CISLO",0,0,null,null,null,0,0,0,0,"","",0,0,0,0,0,0,null,null,null,null,null,null,null,null,null,null,null,null,null,null,null,null,null,null,null,null,null,null,null,null,null,null,null,null,null,"","","",null,null,"RODNE_CISLO","","",null,null,null,null,null,null,"","",null,null,"",null,"",null,null,null,""]
[{"$f":"evidence!A50","v":0},{"$f":"IF(ISTEXT(evidence!B50),evidence!B50,\"\")","v":""},{"$f":"evidence!C50","v":0},{"$f":"evidence!D50","v":0},1918,{"$f":"evidence!E50","v":0},{"$f":"evidence!L50","v":0},{"$f":"evidence!M50","v":0},{"$f":"evidence!N50","v":0},{"$f":"evidence!O50","v":0},{"$f":"evidence!P50","v":0},0,0,0,{"$f":"evidence!Q50","v":"00:00:00"},1900,2016,0,{"$f":"evidence!S50","v":0},"",null,{"$f":"evidence!F50","v":0},{"$f":"evidence!K50","v":0},null,null,null,0,0,0,0,0,0,0,0,0,0,0,0,0,0,0,0,0,0,0,0,0,null,null,null,null,null,0,0,0,0,0,"RODNE_CISLO",0,0,null,null,null,0,0,0,0,"","",0,0,0,0,0,0,null,null,null,null,null,null,null,null,null,null,null,null,null,null,null,null,null,null,null,null,null,null,null,null,null,null,null,null,null,"","","",null,null,"RODNE_CISLO","","",null,null,null,null,null,null,"","",null,null,"",null,"",null,null,null,""]
[{"$f":"evidence!A51","v":0},{"$f":"IF(ISTEXT(evidence!B51),evidence!B51,\"\")","v":""},{"$f":"evidence!C51","v":0},{"$f":"evidence!D51","v":0},1918,{"$f":"evidence!E51","v":0},{"$f":"evidence!L51","v":0},{"$f":"evidence!M51","v":0},{"$f":"evidence!N51","v":0},{"$f":"evidence!O51","v":0},{"$f":"evidence!P51","v":0},0,0,0,{"$f":"evidence!Q51","v":"00:00:00"},1900,2016,0,{"$f":"evidence!S51","v":0},"",null,{"$f":"evidence!F51","v":0},{"$f":"evidence!K51","v":0},null,null,null,0,0,0,0,0,0,0,0,0,0,0,0,0,0,0,0,0,0,0,0,0,null,null,null,null,null,0,0,0,0,0,"RODNE_CISLO",0,0,null,null,null,0,0,0,0,"","",0,0,0,0,0,0,null,null,null,null,null,null,null,null,null,null,null,null,null,null,null,null,null,null,null,null,null,null,null,null,null,null,null,null,null,"","","",null,null,"RODNE_CISLO","","",null,null,null,null,null,null,"","",null,null,"",null,"",null,null,null,""]
[{"$f":"evidence!A52","v":0},{"$f":"IF(ISTEXT(evidence!B52),evidence!B52,\"\")","v":""},{"$f":"evidence!C52","v":0},{"$f":"evidence!D52","v":0},1918,{"$f":"evidence!E52","v":0},{"$f":"evidence!L52","v":0},{"$f":"evidence!M52","v":0},{"$f":"evidence!N52","v":0},{"$f":"evidence!O52","v":0},{"$f":"evidence!P52","v":0},0,0,0,{"$f":"evidence!Q52","v":"00:00:00"},1900,2016,0,{"$f":"evidence!S52","v":0},"",null,{"$f":"evidence!F52","v":0},{"$f":"evidence!K52","v":0},null,null,null,0,0,0,0,0,0,0,0,0,0,0,0,0,0,0,0,0,0,0,0,0,null,null,null,null,null,0,0,0,0,0,"RODNE_CISLO",0,0,null,null,null,0,0,0,0,"","",0,0,0,0,0,0,null,null,null,null,null,null,null,null,null,null,null,null,null,null,null,null,null,null,null,null,null,null,null,null,null,null,null,null,null,"","","",null,null,"RODNE_CISLO","","",null,null,null,null,null,null,"","",null,null,"",null,"",null,null,null,""]
[{"$f":"evidence!A53","v":0},{"$f":"IF(ISTEXT(evidence!B53),evidence!B53,\"\")","v":""},{"$f":"evidence!C53","v":0},{"$f":"evidence!D53","v":0},1918,{"$f":"evidence!E53","v":0},{"$f":"evidence!L53","v":0},{"$f":"evidence!M53","v":0},{"$f":"evidence!N53","v":0},{"$f":"evidence!O53","v":0},{"$f":"evidence!P53","v":0},0,0,0,{"$f":"evidence!Q53","v":"00:00:00"},1900,2016,0,{"$f":"evidence!S53","v":0},"",null,{"$f":"evidence!F53","v":0},{"$f":"evidence!K53","v":0},null,null,null,0,0,0,0,0,0,0,0,0,0,0,0,0,0,0,0,0,0,0,0,0,null,null,null,null,null,0,0,0,0,0,"RODNE_CISLO",0,0,null,null,null,0,0,0,0,"","",0,0,0,0,0,0,null,null,null,null,null,null,null,null,null,null,null,null,null,null,null,null,null,null,null,null,null,null,null,null,null,null,null,null,null,"","","",null,null,"RODNE_CISLO","","",null,null,null,null,null,null,"","",null,null,"",null,"",null,null,null,""]
[{"$f":"evidence!A54","v":0},{"$f":"IF(ISTEXT(evidence!B54),evidence!B54,\"\")","v":""},{"$f":"evidence!C54","v":0},{"$f":"evidence!D54","v":0},1918,{"$f":"evidence!E54","v":0},{"$f":"evidence!L54","v":0},{"$f":"evidence!M54","v":0},{"$f":"evidence!N54","v":0},{"$f":"evidence!O54","v":0},{"$f":"evidence!P54","v":0},0,0,0,{"$f":"evidence!Q54","v":"00:00:00"},1900,2016,0,{"$f":"evidence!S54","v":0},"",null,{"$f":"evidence!F54","v":0},{"$f":"evidence!K54","v":0},null,null,null,0,0,0,0,0,0,0,0,0,0,0,0,0,0,0,0,0,0,0,0,0,null,null,null,null,null,0,0,0,0,0,"RODNE_CISLO",0,0,null,null,null,0,0,0,0,"","",0,0,0,0,0,0,null,null,null,null,null,null,null,null,null,null,null,null,null,null,null,null,null,null,null,null,null,null,null,null,null,null,null,null,null,"","","",null,null,"RODNE_CISLO","","",null,null,null,null,null,null,"","",null,null,"",null,"",null,null,null,""]
[{"$f":"evidence!A55","v":0},{"$f":"IF(ISTEXT(evidence!B55),evidence!B55,\"\")","v":""},{"$f":"evidence!C55","v":0},{"$f":"evidence!D55","v":0},1918,{"$f":"evidence!E55","v":0},{"$f":"evidence!L55","v":0},{"$f":"evidence!M55","v":0},{"$f":"evidence!N55","v":0},{"$f":"evidence!O55","v":0},{"$f":"evidence!P55","v":0},0,0,0,{"$f":"evidence!Q55","v":"00:00:00"},1900,2016,0,{"$f":"evidence!S55","v":0},"",null,{"$f":"evidence!F55","v":0},{"$f":"evidence!K55","v":0},null,null,null,0,0,0,0,0,0,0,0,0,0,0,0,0,0,0,0,0,0,0,0,0,null,null,null,null,null,0,0,0,0,0,"RODNE_CISLO",0,0,null,null,null,0,0,0,0,"","",0,0,0,0,0,0,null,null,null,null,null,null,null,null,null,null,null,null,null,null,null,null,null,null,null,null,null,null,null,null,null,null,null,null,null,"","","",null,null,"RODNE_CISLO","","",null,null,null,null,null,null,"","",null,null,"",null,"",null,null,null,""]
[{"$f":"evidence!A56","v":0},{"$f":"IF(ISTEXT(evidence!B56),evidence!B56,\"\")","v":""},{"$f":"evidence!C56","v":0},{"$f":"evidence!D56","v":0},1918,{"$f":"evidence!E56","v":0},{"$f":"evidence!L56","v":0},{"$f":"evidence!M56","v":0},{"$f":"evidence!N56","v":0},{"$f":"evidence!O56","v":0},{"$f":"evidence!P56","v":0},0,0,0,{"$f":"evidence!Q56","v":"00:00:00"},1900,2016,0,{"$f":"evidence!S56","v":0},"",null,{"$f":"evidence!F56","v":0},{"$f":"evidence!K56","v":0},null,null,null,0,0,0,0,0,0,0,0,0,0,0,0,0,0,0,0,0,0,0,0,0,null,null,null,null,null,0,0,0,0,0,"RODNE_CISLO",0,0,null,null,null,0,0,0,0,"","",0,0,0,0,0,0,null,null,null,null,null,null,null,null,null,null,null,null,null,null,null,null,null,null,null,null,null,null,null,null,null,null,null,null,null,"","","",null,null,"RODNE_CISLO","","",null,null,null,null,null,null,"","",null,null,"",null,"",null,null,null,""]
[{"$f":"evidence!A57","v":0},{"$f":"IF(ISTEXT(evidence!B57),evidence!B57,\"\")","v":""},{"$f":"evidence!C57","v":0},{"$f":"evidence!D57","v":0},1918,{"$f":"evidence!E57","v":0},{"$f":"evidence!L57","v":0},{"$f":"evidence!M57","v":0},{"$f":"evidence!N57","v":0},{"$f":"evidence!O57","v":0},{"$f":"evidence!P57","v":0},0,0,0,{"$f":"evidence!Q57","v":"00:00:00"},1900,2016,0,{"$f":"evidence!S57","v":0},"",null,{"$f":"evidence!F57","v":0},{"$f":"evidence!K57","v":0},null,null,null,0,0,0,0,0,0,0,0,0,0,0,0,0,0,0,0,0,0,0,0,0,null,null,null,null,null,0,0,0,0,0,"RODNE_CISLO",0,0,null,null,null,0,0,0,0,"","",0,0,0,0,0,0,null,null,null,null,null,null,null,null,null,null,null,null,null,null,null,null,null,null,null,null,null,null,null,null,null,null,null,null,null,"","","",null,null,"RODNE_CISLO","","",null,null,null,null,null,null,"","",null,null,"",null,"",null,null,null,""]
[{"$f":"evidence!A58","v":0},{"$f":"IF(ISTEXT(evidence!B58),evidence!B58,\"\")","v":""},{"$f":"evidence!C58","v":0},{"$f":"evidence!D58","v":0},1918,{"$f":"evidence!E58","v":0},{"$f":"evidence!L58","v":0},{"$f":"evidence!M58","v":0},{"$f":"evidence!N58","v":0},{"$f":"evidence!O58","v":0},{"$f":"evidence!P58","v":0},0,0,0,{"$f":"evidence!Q58","v":"00:00:00"},1900,2016,0,{"$f":"evidence!S58","v":0},"",null,{"$f":"evidence!F58","v":0},{"$f":"evidence!K58","v":0},null,null,null,0,0,0,0,0,0,0,0,0,0,0,0,0,0,0,0,0,0,0,0,0,null,null,null,null,null,0,0,0,0,0,"RODNE_CISLO",0,0,null,null,null,0,0,0,0,"","",0,0,0,0,0,0,null,null,null,null,null,null,null,null,null,null,null,null,null,null,null,null,null,null,null,null,null,null,null,null,null,null,null,null,null,"","","",null,null,"RODNE_CISLO","","",null,null,null,null,null,null,"","",null,null,"",null,"",null,null,null,""]
[{"$f":"evidence!A59","v":0},{"$f":"IF(ISTEXT(evidence!B59),evidence!B59,\"\")","v":""},{"$f":"evidence!C59","v":0},{"$f":"evidence!D59","v":0},1918,{"$f":"evidence!E59","v":0},{"$f":"evidence!L59","v":0},{"$f":"evidence!M59","v":0},{"$f":"evidence!N59","v":0},{"$f":"evidence!O59","v":0},{"$f":"evidence!P59","v":0},0,0,0,{"$f":"evidence!Q59","v":"00:00:00"},1900,2016,0,{"$f":"evidence!S59","v":0},"",null,{"$f":"evidence!F59","v":0},{"$f":"evidence!K59","v":0},null,null,null,0,0,0,0,0,0,0,0,0,0,0,0,0,0,0,0,0,0,0,0,0,null,null,null,null,null,0,0,0,0,0,"RODNE_CISLO",0,0,null,null,null,0,0,0,0,"","",0,0,0,0,0,0,null,null,null,null,null,null,null,null,null,null,null,null,null,null,null,null,null,null,null,null,null,null,null,null,null,null,null,null,null,"","","",null,null,"RODNE_CISLO","","",null,null,null,null,null,null,"","",null,null,"",null,"",null,null,null,""]
[{"$f":"evidence!A60","v":0},{"$f":"IF(ISTEXT(evidence!B60),evidence!B60,\"\")","v":""},{"$f":"evidence!C60","v":0},{"$f":"evidence!D60","v":0},1918,{"$f":"evidence!E60","v":0},{"$f":"evidence!L60","v":0},{"$f":"evidence!M60","v":0},{"$f":"evidence!N60","v":0},{"$f":"evidence!O60","v":0},{"$f":"evidence!P60","v":0},0,0,0,{"$f":"evidence!Q60","v":"00:00:00"},1900,2016,0,{"$f":"evidence!S60","v":0},"",null,{"$f":"evidence!F60","v":0},{"$f":"evidence!K60","v":0},null,null,null,0,0,0,0,0,0,0,0,0,0,0,0,0,0,0,0,0,0,0,0,0,null,null,null,null,null,0,0,0,0,0,"RODNE_CISLO",0,0,null,null,null,0,0,0,0,"","",0,0,0,0,0,0,null,null,null,null,null,null,null,null,null,null,null,null,null,null,null,null,null,null,null,null,null,null,null,null,null,null,null,null,null,"","","",null,null,"RODNE_CISLO","","",null,null,null,null,null,null,"","",null,null,"",null,"",null,null,null,""]
[{"$f":"evidence!A61","v":0},{"$f":"IF(ISTEXT(evidence!B61),evidence!B61,\"\")","v":""},{"$f":"evidence!C61","v":0},{"$f":"evidence!D61","v":0},1918,{"$f":"evidence!E61","v":0},{"$f":"evidence!L61","v":0},{"$f":"evidence!M61","v":0},{"$f":"evidence!N61","v":0},{"$f":"evidence!O61","v":0},{"$f":"evidence!P61","v":0},0,0,0,{"$f":"evidence!Q61","v":"00:00:00"},1900,2016,0,{"$f":"evidence!S61","v":0},"",null,{"$f":"evidence!F61","v":0},{"$f":"evidence!K61","v":0},null,null,null,0,0,0,0,0,0,0,0,0,0,0,0,0,0,0,0,0,0,0,0,0,null,null,null,null,null,0,0,0,0,0,"RODNE_CISLO",0,0,null,null,null,0,0,0,0,"","",0,0,0,0,0,0,null,null,null,null,null,null,null,null,null,null,null,null,null,null,null,null,null,null,null,null,null,null,null,null,null,null,null,null,null,"","","",null,null,"RODNE_CISLO","","",null,null,null,null,null,null,"","",null,null,"",null,"",null,null,null,""]
[{"$f":"evidence!A62","v":0},{"$f":"IF(ISTEXT(evidence!B62),evidence!B62,\"\")","v":""},{"$f":"evidence!C62","v":0},{"$f":"evidence!D62","v":0},1918,{"$f":"evidence!E62","v":0},{"$f":"evidence!L62","v":0},{"$f":"evidence!M62","v":0},{"$f":"evidence!N62","v":0},{"$f":"evidence!O62","v":0},{"$f":"evidence!P62","v":0},0,0,0,{"$f":"evidence!Q62","v":"00:00:00"},1900,2016,0,{"$f":"evidence!S62","v":0},"",null,{"$f":"evidence!F62","v":0},{"$f":"evidence!K62","v":0},null,null,null,0,0,0,0,0,0,0,0,0,0,0,0,0,0,0,0,0,0,0,0,0,null,null,null,null,null,0,0,0,0,0,"RODNE_CISLO",0,0,null,null,null,0,0,0,0,"","",0,0,0,0,0,0,null,null,null,null,null,null,null,null,null,null,null,null,null,null,null,null,null,null,null,null,null,null,null,null,null,null,null,null,null,"","","",null,null,"RODNE_CISLO","","",null,null,null,null,null,null,"","",null,null,"",null,"",null,null,null,""]
[{"$f":"evidence!A63","v":0},{"$f":"IF(ISTEXT(evidence!B63),evidence!B63,\"\")","v":""},{"$f":"evidence!C63","v":0},{"$f":"evidence!D63","v":0},1918,{"$f":"evidence!E63","v":0},{"$f":"evidence!L63","v":0},{"$f":"evidence!M63","v":0},{"$f":"evidence!N63","v":0},{"$f":"evidence!O63","v":0},{"$f":"evidence!P63","v":0},0,0,0,{"$f":"evidence!Q63","v":"00:00:00"},1900,2016,0,{"$f":"evidence!S63","v":0},"",null,{"$f":"evidence!F63","v":0},{"$f":"evidence!K63","v":0},null,null,null,0,0,0,0,0,0,0,0,0,0,0,0,0,0,0,0,0,0,0,0,0,null,null,null,null,null,0,0,0,0,0,"RODNE_CISLO",0,0,null,null,null,0,0,0,0,"","",0,0,0,0,0,0,null,null,null,null,null,null,null,null,null,null,null,null,null,null,null,null,null,null,null,null,null,null,null,null,null,null,null,null,null,"","","",null,null,"RODNE_CISLO","","",null,null,null,null,null,null,"","",null,null,"",null,"",null,null,null,""]
[{"$f":"evidence!A64","v":0},{"$f":"IF(ISTEXT(evidence!B64),evidence!B64,\"\")","v":""},{"$f":"evidence!C64","v":0},{"$f":"evidence!D64","v":0},1918,{"$f":"evidence!E64","v":0},{"$f":"evidence!L64","v":0},{"$f":"evidence!M64","v":0},{"$f":"evidence!N64","v":0},{"$f":"evidence!O64","v":0},{"$f":"evidence!P64","v":0},0,0,0,{"$f":"evidence!Q64","v":"00:00:00"},1900,2016,0,{"$f":"evidence!S64","v":0},"",null,{"$f":"evidence!F64","v":0},{"$f":"evidence!K64","v":0},null,null,null,0,0,0,0,0,0,0,0,0,0,0,0,0,0,0,0,0,0,0,0,0,null,null,null,null,null,0,0,0,0,0,"RODNE_CISLO",0,0,null,null,null,0,0,0,0,"","",0,0,0,0,0,0,null,null,null,null,null,null,null,null,null,null,null,null,null,null,null,null,null,null,null,null,null,null,null,null,null,null,null,null,null,"","","",null,null,"RODNE_CISLO","","",null,null,null,null,null,null,"","",null,null,"",null,"",null,null,null,""]
[{"$f":"evidence!A65","v":0},{"$f":"IF(ISTEXT(evidence!B65),evidence!B65,\"\")","v":""},{"$f":"evidence!C65","v":0},{"$f":"evidence!D65","v":0},1918,{"$f":"evidence!E65","v":0},{"$f":"evidence!L65","v":0},{"$f":"evidence!M65","v":0},{"$f":"evidence!N65","v":0},{"$f":"evidence!O65","v":0},{"$f":"evidence!P65","v":0},0,0,0,{"$f":"evidence!Q65","v":"00:00:00"},1900,2016,0,{"$f":"evidence!S65","v":0},"",null,{"$f":"evidence!F65","v":0},{"$f":"evidence!K65","v":0},null,null,null,0,0,0,0,0,0,0,0,0,0,0,0,0,0,0,0,0,0,0,0,0,null,null,null,null,null,0,0,0,0,0,"RODNE_CISLO",0,0,null,null,null,0,0,0,0,"","",0,0,0,0,0,0,null,null,null,null,null,null,null,null,null,null,null,null,null,null,null,null,null,null,null,null,null,null,null,null,null,null,null,null,null,"","","",null,null,"RODNE_CISLO","","",null,null,null,null,null,null,"","",null,null,"",null,"",null,null,null,""]
[{"$f":"evidence!A66","v":0},{"$f":"IF(ISTEXT(evidence!B66),evidence!B66,\"\")","v":""},{"$f":"evidence!C66","v":0},{"$f":"evidence!D66","v":0},1918,{"$f":"evidence!E66","v":0},{"$f":"evidence!L66","v":0},{"$f":"evidence!M66","v":0},{"$f":"evidence!N66","v":0},{"$f":"evidence!O66","v":0},{"$f":"evidence!P66","v":0},0,0,0,{"$f":"evidence!Q66","v":"00:00:00"},1900,2016,0,{"$f":"evidence!S66","v":0},"",null,{"$f":"evidence!F66","v":0},{"$f":"evidence!K66","v":0},null,null,null,0,0,0,0,0,0,0,0,0,0,0,0,0,0,0,0,0,0,0,0,0,null,null,null,null,null,0,0,0,0,0,"RODNE_CISLO",0,0,null,null,null,0,0,0,0,"","",0,0,0,0,{"$f":"IF((AN68>0),T68,0)","v":0},{"$f":"IF((AN68>0),AU68,0)","v":0},null,null,null,null,null,null,null,null,null,null,null,null,null,null,null,null,null,null,null,null,null,null,null,null,null,null,null,null,null,"","","",null,null,"RODNE_CISLO","","",null,null,null,null,null,null,"","",null,null,"",null,"",null,null,null,""]
[{"$f":"evidence!A67","v":0},{"$f":"IF(ISTEXT(evidence!B67),evidence!B67,\"\")","v":""},{"$f":"evidence!C67","v":0},{"$f":"evidence!D67","v":0},{"$f":"YEAR(D69)+$E$2","v":1918},{"$f":"evidence!E67","v":0},{"$f":"evidence!L67","v":0},{"$f":"evidence!M67","v":0},{"$f":"evidence!N67","v":0},{"$f":"evidence!O67","v":0},{"$f":"evidence!P67","v":0},{"$f":"IF((I69=\"ano\"),1,IF(OR(J69=\"ano\"),1,0))","v":0},{"$f":"IF((K69=\"ano\"),1,0)","v":0},{"$f":"IF((T69=\"ANO\"),SUM(L69:M69),0)","v":0},{"$f":"evidence!Q67","v":"00:00:00"},{"$f":"YEAR(O69)","v":1900},{"$f":"MAX(E69,P69,$Q$2)","v":2016},{"$f":"IF(ISTEXT(A69),1,0)","v":0},{"$f":"evidence!S67","v":0},{"$f":"IF(LEN(F69)<9,\"\",\"ANO\")","v":""},null,{"$f":"evidence!F67","v":0},{"$f":"evidence!K67","v":0},null,null,null,{"$f":"IF((T69=\"ANO\"),A69,0)","v":0},{"$f":"IF((T69=\"ANO\"),B69,0)","v":0},{"$f":"IF((T69=\"ANO\"),C69,0)","v":0},{"$f":"IF((T69=\"ANO\"),D69,0)","v":0},{"$f":"IF((T69=\"ANO\"),E69,0)","v":0},{"$f":"IF((T69=\"ANO\"),F69,0)","v":0},{"$f":"IF((T69=\"ANO\"),G69,0)","v":0},{"$f":"IF((T69=\"ANO\"),H69,0)","v":0},{"$f":"IF((T69=\"ANO\"),I69,0)","v":0},{"$f":"IF((T69=\"ANO\"),J69,0)","v":0},{"$f":"IF((T69=\"ANO\"),K69,0)","v":0},{"$f":"IF((T69=\"ANO\"),L69,0)","v":0},{"$f":"IF((T69=\"ANO\"),M69,0)","v":0},{"$f":"IF((T69=\"ANO\"),N69,0)","v":0},{"$f":"IF((T69=\"ANO\"),O69,0)","v":0},{"$f":"IF((T69=\"ANO\"),P69,0)","v":0},{"$f":"IF((T69=\"ANO\"),Q69,0)","v":0},{"$f":"IF((T69=\"ANO\"),R69,0)","v":0},{"$f":"IF((T69=\"ANO\"),S69,0)","v":0},{"$f":"IF((T69=\"ANO\"),V69,0)","v":0},{"$f":"IF((T69=\"ANO\"),W69,0)","v":0},null,null,null,null,null,{"$f":"IF((AN69>0),A69,0)","v":0},{"$f":"IF((AN69>0),B69,0)","v":0},{"$f":"IF((AN69>0),C69,0)","v":0},{"$f":"IF((AN69>0),D69,0)","v":0},{"$f":"IF((AN69>0),E69,0)","v":0},{"$f":"IF((AN69>0),F69,\"RODNE_CISLO\")","v":"RODNE_CISLO"},{"$f":"IF((AN69>0),G69,0)","v":0},{"$f":"IF((AN69>0),H69,0)","v":0},null,null,null,{"$f":"IF((AL69>0),L69,0)","v":0},{"$f":"IF((AM69>0),M69,0)","v":0},{"$f":"IF((AN69>0),N69,0)","v":0},{"$f":"IF((AN69>0),O69,0)","v":0},{"$f":"IF((AL69>0),P69,\"\")","v":""},{"$f":"IF((AM69>0),Q69,\"\")","v":""},{"$f":"IF((AN69>0),R69,0)","v":0},{"$f":"IF((AN69>0),S69,0)","v":0},{"$f":"IF((AN69>0),AT69,0)","v":0},{"$f":"IF((AN69>0),AU69,0)","v":0},0,0,null,null,null,null,null,null,null,null,null,null,null,null,null,null,null,null,null,null,null,null,null,null,null,null,null,null,null,null,null,{"$f":"IF(ISTEXT(CA69),CG69,\"\")","v":""},{"$f":"IF(ISTEXT(CA69),CA69,\"\")","v":""},{"$f":"IF(ISTEXT(CA69),CC69,\"\")","v":""},null,null,{"$f":"IF(ISTEXT(CA69),CF69,\"RODNE_CISLO\")","v":"RODNE_CISLO"},{"$f":"IF(ISTEXT(CA69),\"CZE\",\"\")","v":""},{"$f":"IF(ISTEXT(CA69),CD69,\"\")","v":""},null,null,null,null,null,null,{"$f":"IF(ISTEXT(CA69),CL69,\"\")","v":""},{"$f":"IF(ISTEXT(CA69),CO69,\"\")","v":""},null,null,{"$f":"IF(ISTEXT(CA69),$DY$2,\"\")","v":""},null,{"$f":"IF(ISTEXT(CA69),CM69,\"\")","v":""},null,null,null,{"$f":"IF(ISTEXT(CA69),$DY$2,\"\")","v":""}]
[{"$f":"evidence!A68","v":0},{"$f":"IF(ISTEXT(evidence!B68),evidence!B68,\"\")","v":""},{"$f":"evidence!C68","v":0},{"$f":"evidence!D68","v":0},1918,{"$f":"evidence!E68","v":0},{"$f":"evidence!L68","v":0},{"$f":"evidence!M68","v":0},{"$f":"evidence!N68","v":0},{"$f":"evidence!O68","v":0},{"$f":"evidence!P68","v":0},0,0,0,{"$f":"evidence!Q68","v":"00:00:00"},1900,2016,0,{"$f":"evidence!S68","v":0},"",null,{"$f":"evidence!F68","v":0},{"$f":"evidence!K68","v":0},null,null,null,0,0,0,0,0,0,0,0,0,0,0,0,0,0,0,0,0,0,0,0,0,null,null,null,null,null,0,0,0,0,0,"RODNE_CISLO",0,0,null,null,null,0,0,0,0,"","",0,0,0,0,0,0,null,null,null,null,null,null,null,null,null,null,null,null,null,null,null,null,null,null,null,null,null,null,null,null,null,null,null,null,null,"","","",null,null,"RODNE_CISLO","","",null,null,null,null,null,null,"","",null,null,"",null,"",null,null,null,""]
[{"$f":"evidence!A69","v":0},{"$f":"IF(ISTEXT(evidence!B69),evidence!B69,\"\")","v":""},{"$f":"evidence!C69","v":0},{"$f":"evidence!D69","v":0},1918,{"$f":"evidence!E69","v":0},{"$f":"evidence!L69","v":0},{"$f":"evidence!M69","v":0},{"$f":"evidence!N69","v":0},{"$f":"evidence!O69","v":0},{"$f":"evidence!P69","v":0},0,0,0,{"$f":"evidence!Q69","v":"00:00:00"},1900,2016,0,{"$f":"evidence!S69","v":0},"",null,{"$f":"evidence!F69","v":0},{"$f":"evidence!K69","v":0},null,null,null,0,0,0,0,0,0,0,0,0,0,0,0,0,0,0,0,0,0,0,0,0,null,null,null,null,null,0,0,0,0,0,"RODNE_CISLO",0,0,null,null,null,0,0,0,0,"","",0,0,0,0,0,0,null,null,null,null,null,null,null,null,null,null,null,null,null,null,null,null,null,null,null,null,null,null,null,null,null,null,null,null,null,"","","",null,null,"RODNE_CISLO","","",null,null,null,null,null,null,"","",null,null,"",null,"",null,null,null,""]
[{"$f":"evidence!A70","v":0},{"$f":"IF(ISTEXT(evidence!B70),evidence!B70,\"\")","v":""},{"$f":"evidence!C70","v":0},{"$f":"evidence!D70","v":0},1918,{"$f":"evidence!E70","v":0},{"$f":"evidence!L70","v":0},{"$f":"evidence!M70","v":0},{"$f":"evidence!N70","v":0},{"$f":"evidence!O70","v":0},{"$f":"evidence!P70","v":0},0,0,0,{"$f":"evidence!Q70","v":"00:00:00"},1900,2016,0,{"$f":"evidence!S70","v":0},"",null,{"$f":"evidence!F70","v":0},{"$f":"evidence!K70","v":0},null,null,null,0,0,0,0,0,0,0,0,0,0,0,0,0,0,0,0,0,0,0,0,0,null,null,null,null,null,0,0,0,0,0,"RODNE_CISLO",0,0,null,null,null,0,0,0,0,"","",0,0,0,0,0,0,null,null,null,null,null,null,null,null,null,null,null,null,null,null,null,null,null,null,null,null,null,null,null,null,null,null,null,null,null,"","","",null,null,"RODNE_CISLO","","",null,null,null,null,null,null,"","",null,null,"",null,"",null,null,null,""]
[{"$f":"evidence!A71","v":0},{"$f":"IF(ISTEXT(evidence!B71),evidence!B71,\"\")","v":""},{"$f":"evidence!C71","v":0},{"$f":"evidence!D71","v":0},1918,{"$f":"evidence!E71","v":0},{"$f":"evidence!L71","v":0},{"$f":"evidence!M71","v":0},{"$f":"evidence!N71","v":0},{"$f":"evidence!O71","v":0},{"$f":"evidence!P71","v":0},0,0,0,{"$f":"evidence!Q71","v":"00:00:00"},1900,2016,0,{"$f":"evidence!S71","v":0},"",null,{"$f":"evidence!F71","v":0},{"$f":"evidence!K71","v":0},null,null,null,0,0,0,0,0,0,0,0,0,0,0,0,0,0,0,0,0,0,0,0,0,null,null,null,null,null,0,0,0,0,0,"RODNE_CISLO",0,0,null,null,null,0,0,0,0,"","",0,0,0,0,0,0,null,null,null,null,null,null,null,null,null,null,null,null,null,null,null,null,null,null,null,null,null,null,null,null,null,null,null,null,null,"","","",null,null,"RODNE_CISLO","","",null,null,null,null,null,null,"","",null,null,"",null,"",null,null,null,""]
[{"$f":"evidence!A72","v":0},{"$f":"IF(ISTEXT(evidence!B72),evidence!B72,\"\")","v":""},{"$f":"evidence!C72","v":0},{"$f":"evidence!D72","v":0},1918,{"$f":"evidence!E72","v":0},{"$f":"evidence!L72","v":0},{"$f":"evidence!M72","v":0},{"$f":"evidence!N72","v":0},{"$f":"evidence!O72","v":0},{"$f":"evidence!P72","v":0},0,0,0,{"$f":"evidence!Q72","v":"00:00:00"},1900,2016,0,{"$f":"evidence!S72","v":0},"",null,{"$f":"evidence!F72","v":0},{"$f":"evidence!K72","v":0},null,null,null,0,0,0,0,0,0,0,0,0,0,0,0,0,0,0,0,0,0,0,0,0,null,null,null,null,null,0,0,0,0,0,"RODNE_CISLO",0,0,null,null,null,0,0,0,0,"","",0,0,0,0,0,0,null,null,null,null,null,null,null,null,null,null,null,null,null,null,null,null,null,null,null,null,null,null,null,null,null,null,null,null,null,"","","",null,null,"RODNE_CISLO","","",null,null,null,null,null,null,"","",null,null,"",null,"",null,null,null,""]
[{"$f":"evidence!A73","v":0},{"$f":"IF(ISTEXT(evidence!B73),evidence!B73,\"\")","v":""},{"$f":"evidence!C73","v":0},{"$f":"evidence!D73","v":0},1918,{"$f":"evidence!E73","v":0},{"$f":"evidence!L73","v":0},{"$f":"evidence!M73","v":0},{"$f":"evidence!N73","v":0},{"$f":"evidence!O73","v":0},{"$f":"evidence!P73","v":0},0,0,0,{"$f":"evidence!Q73","v":"00:00:00"},1900,2016,0,{"$f":"evidence!S73","v":0},"",null,{"$f":"evidence!F73","v":0},{"$f":"evidence!K73","v":0},null,null,null,0,0,0,0,0,0,0,0,0,0,0,0,0,0,0,0,0,0,0,0,0,null,null,null,null,null,0,0,0,0,0,"RODNE_CISLO",0,0,null,null,null,0,0,0,0,"","",0,0,0,0,0,0,null,null,null,null,null,null,null,null,null,null,null,null,null,null,null,null,null,null,null,null,null,null,null,null,null,null,null,null,null,"","","",null,null,"RODNE_CISLO","","",null,null,null,null,null,null,"","",null,null,"",null,"",null,null,null,""]
[{"$f":"evidence!A74","v":0},{"$f":"IF(ISTEXT(evidence!B74),evidence!B74,\"\")","v":""},{"$f":"evidence!C74","v":0},{"$f":"evidence!D74","v":0},1918,{"$f":"evidence!E74","v":0},{"$f":"evidence!L74","v":0},{"$f":"evidence!M74","v":0},{"$f":"evidence!N74","v":0},{"$f":"evidence!O74","v":0},{"$f":"evidence!P74","v":0},0,0,0,{"$f":"evidence!Q74","v":"00:00:00"},1900,2016,0,{"$f":"evidence!S74","v":0},"",null,{"$f":"evidence!F74","v":0},{"$f":"evidence!K74","v":0},null,null,null,0,0,0,0,0,0,0,0,0,0,0,0,0,0,0,0,0,0,0,0,0,null,null,null,null,null,0,0,0,0,0,"RODNE_CISLO",0,0,null,null,null,0,0,0,0,"","",0,0,0,0,0,0,null,null,null,null,null,null,null,null,null,null,null,null,null,null,null,null,null,null,null,null,null,null,null,null,null,null,null,null,null,"","","",null,null,"RODNE_CISLO","","",null,null,null,null,null,null,"","",null,null,"",null,"",null,null,null,""]
[{"$f":"evidence!A75","v":0},{"$f":"IF(ISTEXT(evidence!B75),evidence!B75,\"\")","v":""},{"$f":"evidence!C75","v":0},{"$f":"evidence!D75","v":0},1918,{"$f":"evidence!E75","v":0},{"$f":"evidence!L75","v":0},{"$f":"evidence!M75","v":0},{"$f":"evidence!N75","v":0},{"$f":"evidence!O75","v":0},{"$f":"evidence!P75","v":0},0,0,0,{"$f":"evidence!Q75","v":"00:00:00"},1900,2016,0,{"$f":"evidence!S75","v":0},"",null,{"$f":"evidence!F75","v":0},{"$f":"evidence!K75","v":0},null,null,null,0,0,0,0,0,0,0,0,0,0,0,0,0,0,0,0,0,0,0,0,0,null,null,null,null,null,0,0,0,0,0,"RODNE_CISLO",0,0,null,null,null,0,0,0,0,"","",0,0,0,0,0,0,null,null,null,null,null,null,null,null,null,null,null,null,null,null,null,null,null,null,null,null,null,null,null,null,null,null,null,null,null,"","","",null,null,"RODNE_CISLO","","",null,null,null,null,null,null,"","",null,null,"",null,"",null,null,null,""]
[{"$f":"evidence!A76","v":0},{"$f":"IF(ISTEXT(evidence!B76),evidence!B76,\"\")","v":""},{"$f":"evidence!C76","v":0},{"$f":"evidence!D76","v":0},1918,{"$f":"evidence!E76","v":0},{"$f":"evidence!L76","v":0},{"$f":"evidence!M76","v":0},{"$f":"evidence!N76","v":0},{"$f":"evidence!O76","v":0},{"$f":"evidence!P76","v":0},0,0,0,{"$f":"evidence!Q76","v":"00:00:00"},1900,2016,0,{"$f":"evidence!S76","v":0},"",null,{"$f":"evidence!F76","v":0},{"$f":"evidence!K76","v":0},null,null,null,0,0,0,0,0,0,0,0,0,0,0,0,0,0,0,0,0,0,0,0,0,null,null,null,null,null,0,0,0,0,0,"RODNE_CISLO",0,0,null,null,null,0,0,0,0,"","",0,0,0,0,0,0,null,null,null,null,null,null,null,null,null,null,null,null,null,null,null,null,null,null,null,null,null,null,null,null,null,null,null,null,null,"","","",null,null,"RODNE_CISLO","","",null,null,null,null,null,null,"","",null,null,"",null,"",null,null,null,""]
[{"$f":"evidence!A77","v":0},{"$f":"IF(ISTEXT(evidence!B77),evidence!B77,\"\")","v":""},{"$f":"evidence!C77","v":0},{"$f":"evidence!D77","v":0},1918,{"$f":"evidence!E77","v":0},{"$f":"evidence!L77","v":0},{"$f":"evidence!M77","v":0},{"$f":"evidence!N77","v":0},{"$f":"evidence!O77","v":0},{"$f":"evidence!P77","v":0},0,0,0,{"$f":"evidence!Q77","v":"00:00:00"},1900,2016,0,{"$f":"evidence!S77","v":0},"",null,{"$f":"evidence!F77","v":0},{"$f":"evidence!K77","v":0},null,null,null,0,0,0,0,0,0,0,0,0,0,0,0,0,0,0,0,0,0,0,0,0,null,null,null,null,null,0,0,0,0,0,"RODNE_CISLO",0,0,null,null,null,0,0,0,0,"","",0,0,0,0,0,0,null,null,null,null,null,null,null,null,null,null,null,null,null,null,null,null,null,null,null,null,null,null,null,null,null,null,null,null,null,"","","",null,null,"RODNE_CISLO","","",null,null,null,null,null,null,"","",null,null,"",null,"",null,null,null,""]
[{"$f":"evidence!A78","v":0},{"$f":"IF(ISTEXT(evidence!B78),evidence!B78,\"\")","v":""},{"$f":"evidence!C78","v":0},{"$f":"evidence!D78","v":0},1918,{"$f":"evidence!E78","v":0},{"$f":"evidence!L78","v":0},{"$f":"evidence!M78","v":0},{"$f":"evidence!N78","v":0},{"$f":"evidence!O78","v":0},{"$f":"evidence!P78","v":0},0,0,0,{"$f":"evidence!Q78","v":"00:00:00"},1900,2016,0,{"$f":"evidence!S78","v":0},"",null,{"$f":"evidence!F78","v":0},{"$f":"evidence!K78","v":0},null,null,null,0,0,0,0,0,0,0,0,0,0,0,0,0,0,0,0,0,0,0,0,0,null,null,null,null,null,0,0,0,0,0,"RODNE_CISLO",0,0,null,null,null,0,0,0,0,"","",0,0,0,0,0,0,null,null,null,null,null,null,null,null,null,null,null,null,null,null,null,null,null,null,null,null,null,null,null,null,null,null,null,null,null,"","","",null,null,"RODNE_CISLO","","",null,null,null,null,null,null,"","",null,null,"",null,"",null,null,null,""]
[{"$f":"evidence!A79","v":0},{"$f":"IF(ISTEXT(evidence!B79),evidence!B79,\"\")","v":""},{"$f":"evidence!C79","v":0},{"$f":"evidence!D79","v":0},1918,{"$f":"evidence!E79","v":0},{"$f":"evidence!L79","v":0},{"$f":"evidence!M79","v":0},{"$f":"evidence!N79","v":0},{"$f":"evidence!O79","v":0},{"$f":"evidence!P79","v":0},0,0,0,{"$f":"evidence!Q79","v":"00:00:00"},1900,2016,0,{"$f":"evidence!S79","v":0},"",null,{"$f":"evidence!F79","v":0},{"$f":"evidence!K79","v":0},null,null,null,0,0,0,0,0,0,0,0,0,0,0,0,0,0,0,0,0,0,0,0,0,null,null,null,null,null,0,0,0,0,0,"RODNE_CISLO",0,0,null,null,null,0,0,0,0,"","",0,0,0,0,0,0,null,null,null,null,null,null,null,null,null,null,null,null,null,null,null,null,null,null,null,null,null,null,null,null,null,null,null,null,null,"","","",null,null,"RODNE_CISLO","","",null,null,null,null,null,null,"","",null,null,"",null,"",null,null,null,""]
[{"$f":"evidence!A80","v":0},{"$f":"IF(ISTEXT(evidence!B80),evidence!B80,\"\")","v":""},{"$f":"evidence!C80","v":0},{"$f":"evidence!D80","v":0},1918,{"$f":"evidence!E80","v":0},{"$f":"evidence!L80","v":0},{"$f":"evidence!M80","v":0},{"$f":"evidence!N80","v":0},{"$f":"evidence!O80","v":0},{"$f":"evidence!P80","v":0},0,0,0,{"$f":"evidence!Q80","v":"00:00:00"},1900,2016,0,{"$f":"evidence!S80","v":0},"",null,{"$f":"evidence!F80","v":0},{"$f":"evidence!K80","v":0},null,null,null,0,0,0,0,0,0,0,0,0,0,0,0,0,0,0,0,0,0,0,0,0,null,null,null,null,null,0,0,0,0,0,"RODNE_CISLO",0,0,null,null,null,0,0,0,0,"","",0,0,0,0,0,0,null,null,null,null,null,null,null,null,null,null,null,null,null,null,null,null,null,null,null,null,null,null,null,null,null,null,null,null,null,"","","",null,null,"RODNE_CISLO","","",null,null,null,null,null,null,"","",null,null,"",null,"",null,null,null,""]
[{"$f":"evidence!A81","v":0},{"$f":"IF(ISTEXT(evidence!B81),evidence!B81,\"\")","v":""},{"$f":"evidence!C81","v":0},{"$f":"evidence!D81","v":0},1918,{"$f":"evidence!E81","v":0},{"$f":"evidence!L81","v":0},{"$f":"evidence!M81","v":0},{"$f":"evidence!N81","v":0},{"$f":"evidence!O81","v":0},{"$f":"evidence!P81","v":0},0,0,0,{"$f":"evidence!Q81","v":"00:00:00"},1900,2016,0,{"$f":"evidence!S81","v":0},"",null,{"$f":"evidence!F81","v":0},{"$f":"evidence!K81","v":0},null,null,null,0,0,0,0,0,0,0,0,0,0,0,0,0,0,0,0,0,0,0,0,0,null,null,null,null,null,0,0,0,0,0,"RODNE_CISLO",0,0,null,null,null,0,0,0,0,"","",0,0,0,0,0,0,null,null,null,null,null,null,null,null,null,null,null,null,null,null,null,null,null,null,null,null,null,null,null,null,null,null,null,null,null,"","","",null,null,"RODNE_CISLO","","",null,null,null,null,null,null,"","",null,null,"",null,"",null,null,null,""]
[{"$f":"evidence!A82","v":0},{"$f":"IF(ISTEXT(evidence!B82),evidence!B82,\"\")","v":""},{"$f":"evidence!C82","v":0},{"$f":"evidence!D82","v":0},1918,{"$f":"evidence!E82","v":0},{"$f":"evidence!L82","v":0},{"$f":"evidence!M82","v":0},{"$f":"evidence!N82","v":0},{"$f":"evidence!O82","v":0},{"$f":"evidence!P82","v":0},0,0,0,{"$f":"evidence!Q82","v":"00:00:00"},1900,2016,0,{"$f":"evidence!S82","v":0},"",null,{"$f":"evidence!F82","v":0},{"$f":"evidence!K82","v":0},null,null,null,0,0,0,0,0,0,0,0,0,0,0,0,0,0,0,0,0,0,0,0,0,null,null,null,null,null,0,0,0,0,0,"RODNE_CISLO",0,0,null,null,null,0,0,0,0,"","",0,0,0,0,0,0,null,null,null,null,null,null,null,null,null,null,null,null,null,null,null,null,null,null,null,null,null,null,null,null,null,null,null,null,null,"","","",null,null,"RODNE_CISLO","","",null,null,null,null,null,null,"","",null,null,"",null,"",null,null,null,""]
[{"$f":"evidence!A83","v":0},{"$f":"IF(ISTEXT(evidence!B83),evidence!B83,\"\")","v":""},{"$f":"evidence!C83","v":0},{"$f":"evidence!D83","v":0},1918,{"$f":"evidence!E83","v":0},{"$f":"evidence!L83","v":0},{"$f":"evidence!M83","v":0},{"$f":"evidence!N83","v":0},{"$f":"evidence!O83","v":0},{"$f":"evidence!P83","v":0},0,0,0,{"$f":"evidence!Q83","v":"00:00:00"},1900,2016,0,{"$f":"evidence!S83","v":0},"",null,{"$f":"evidence!F83","v":0},{"$f":"evidence!K83","v":0},null,null,null,0,0,0,0,0,0,0,0,0,0,0,0,0,0,0,0,0,0,0,0,0,null,null,null,null,null,0,0,0,0,0,"RODNE_CISLO",0,0,null,null,null,0,0,0,0,"","",0,0,0,0,0,0,null,null,null,null,null,null,null,null,null,null,null,null,null,null,null,null,null,null,null,null,null,null,null,null,null,null,null,null,null,"","","",null,null,"RODNE_CISLO","","",null,null,null,null,null,null,"","",null,null,"",null,"",null,null,null,""]
[{"$f":"evidence!A84","v":0},{"$f":"IF(ISTEXT(evidence!B84),evidence!B84,\"\")","v":""},{"$f":"evidence!C84","v":0},{"$f":"evidence!D84","v":0},1918,{"$f":"evidence!E84","v":0},{"$f":"evidence!L84","v":0},{"$f":"evidence!M84","v":0},{"$f":"evidence!N84","v":0},{"$f":"evidence!O84","v":0},{"$f":"evidence!P84","v":0},0,0,0,{"$f":"evidence!Q84","v":"00:00:00"},1900,2016,0,{"$f":"evidence!S84","v":0},"",null,{"$f":"evidence!F84","v":0},{"$f":"evidence!K84","v":0},null,null,null,0,0,0,0,0,0,0,0,0,0,0,0,0,0,0,0,0,0,0,0,0,null,null,null,null,null,0,0,0,0,0,"RODNE_CISLO",0,0,null,null,null,0,0,0,0,"","",0,0,0,0,0,0,null,null,null,null,null,null,null,null,null,null,null,null,null,null,null,null,null,null,null,null,null,null,null,null,null,null,null,null,null,"","","",null,null,"RODNE_CISLO","","",null,null,null,null,null,null,"","",null,null,"",null,"",null,null,null,""]
[{"$f":"evidence!A85","v":0},{"$f":"IF(ISTEXT(evidence!B85),evidence!B85,\"\")","v":""},{"$f":"evidence!C85","v":0},{"$f":"evidence!D85","v":0},1918,{"$f":"evidence!E85","v":0},{"$f":"evidence!L85","v":0},{"$f":"evidence!M85","v":0},{"$f":"evidence!N85","v":0},{"$f":"evidence!O85","v":0},{"$f":"evidence!P85","v":0},0,0,0,{"$f":"evidence!Q85","v":"00:00:00"},1900,2016,0,{"$f":"evidence!S85","v":0},"",null,{"$f":"evidence!F85","v":0},{"$f":"evidence!K85","v":0},null,null,null,0,0,0,0,0,0,0,0,0,0,0,0,0,0,0,0,0,0,0,0,0,null,null,null,null,null,0,0,0,0,0,"RODNE_CISLO",0,0,null,null,null,0,0,0,0,"","",0,0,0,0,0,0,null,null,null,null,null,null,null,null,null,null,null,null,null,null,null,null,null,null,null,null,null,null,null,null,null,null,null,null,null,"","","",null,null,"RODNE_CISLO","","",null,null,null,null,null,null,"","",null,null,"",null,"",null,null,null,""]
[{"$f":"evidence!A86","v":0},{"$f":"IF(ISTEXT(evidence!B86),evidence!B86,\"\")","v":""},{"$f":"evidence!C86","v":0},{"$f":"evidence!D86","v":0},1918,{"$f":"evidence!E86","v":0},{"$f":"evidence!L86","v":0},{"$f":"evidence!M86","v":0},{"$f":"evidence!N86","v":0},{"$f":"evidence!O86","v":0},{"$f":"evidence!P86","v":0},0,0,0,{"$f":"evidence!Q86","v":"00:00:00"},1900,2016,0,{"$f":"evidence!S86","v":0},"",null,{"$f":"evidence!F86","v":0},{"$f":"evidence!K86","v":0},null,null,null,0,0,0,0,0,0,0,0,0,0,0,0,0,0,0,0,0,0,0,0,0,null,null,null,null,null,0,0,0,0,0,"RODNE_CISLO",0,0,null,null,null,0,0,0,0,"","",0,0,0,0,0,0,null,null,null,null,null,null,null,null,null,null,null,null,null,null,null,null,null,null,null,null,null,null,null,null,null,null,null,null,null,"","","",null,null,"RODNE_CISLO","","",null,null,null,null,null,null,"","",null,null,"",null,"",null,null,null,""]
[{"$f":"evidence!A87","v":0},{"$f":"IF(ISTEXT(evidence!B87),evidence!B87,\"\")","v":""},{"$f":"evidence!C87","v":0},{"$f":"evidence!D87","v":0},1918,{"$f":"evidence!E87","v":0},{"$f":"evidence!L87","v":0},{"$f":"evidence!M87","v":0},{"$f":"evidence!N87","v":0},{"$f":"evidence!O87","v":0},{"$f":"evidence!P87","v":0},0,0,0,{"$f":"evidence!Q87","v":"00:00:00"},1900,2016,0,{"$f":"evidence!S87","v":0},"",null,{"$f":"evidence!F87","v":0},{"$f":"evidence!K87","v":0},null,null,null,0,0,0,0,0,0,0,0,0,0,0,0,0,0,0,0,0,0,0,0,0,null,null,null,null,null,0,0,0,0,0,"RODNE_CISLO",0,0,null,null,null,0,0,0,0,"","",0,0,0,0,0,0,null,null,null,null,null,null,null,null,null,null,null,null,null,null,null,null,null,null,null,null,null,null,null,null,null,null,null,null,null,"","","",null,null,"RODNE_CISLO","","",null,null,null,null,null,null,"","",null,null,"",null,"",null,null,null,""]
[{"$f":"evidence!A88","v":0},{"$f":"IF(ISTEXT(evidence!B88),evidence!B88,\"\")","v":""},{"$f":"evidence!C88","v":0},{"$f":"evidence!D88","v":0},1918,{"$f":"evidence!E88","v":0},{"$f":"evidence!L88","v":0},{"$f":"evidence!M88","v":0},{"$f":"evidence!N88","v":0},{"$f":"evidence!O88","v":0},{"$f":"evidence!P88","v":0},0,0,0,{"$f":"evidence!Q88","v":"00:00:00"},1900,2016,0,{"$f":"evidence!S88","v":0},"",null,{"$f":"evidence!F88","v":0},{"$f":"evidence!K88","v":0},null,null,null,0,0,0,0,0,0,0,0,0,0,0,0,0,0,0,0,0,0,0,0,0,null,null,null,null,null,0,0,0,0,0,"RODNE_CISLO",0,0,null,null,null,0,0,0,0,"","",0,0,0,0,0,0,null,null,null,null,null,null,null,null,null,null,null,null,null,null,null,null,null,null,null,null,null,null,null,null,null,null,null,null,null,"","","",null,null,"RODNE_CISLO","","",null,null,null,null,null,null,"","",null,null,"",null,"",null,null,null,""]
[{"$f":"evidence!A89","v":0},{"$f":"IF(ISTEXT(evidence!B89),evidence!B89,\"\")","v":""},{"$f":"evidence!C89","v":0},{"$f":"evidence!D89","v":0},1918,{"$f":"evidence!E89","v":0},{"$f":"evidence!L89","v":0},{"$f":"evidence!M89","v":0},{"$f":"evidence!N89","v":0},{"$f":"evidence!O89","v":0},{"$f":"evidence!P89","v":0},0,0,0,{"$f":"evidence!Q89","v":"00:00:00"},1900,2016,0,{"$f":"evidence!S89","v":0},"",null,{"$f":"evidence!F89","v":0},{"$f":"evidence!K89","v":0},null,null,null,0,0,0,0,0,0,0,0,0,0,0,0,0,0,0,0,0,0,0,0,0,null,null,null,null,null,0,0,0,0,0,"RODNE_CISLO",0,0,null,null,null,0,0,0,0,"","",0,0,0,0,0,0,null,null,null,null,null,null,null,null,null,null,null,null,null,null,null,null,null,null,null,null,null,null,null,null,null,null,null,null,null,"","","",null,null,"RODNE_CISLO","","",null,null,null,null,null,null,"","",null,null,"",null,"",null,null,null,""]
[{"$f":"evidence!A90","v":0},{"$f":"IF(ISTEXT(evidence!B90),evidence!B90,\"\")","v":""},{"$f":"evidence!C90","v":0},{"$f":"evidence!D90","v":0},1918,{"$f":"evidence!E90","v":0},{"$f":"evidence!L90","v":0},{"$f":"evidence!M90","v":0},{"$f":"evidence!N90","v":0},{"$f":"evidence!O90","v":0},{"$f":"evidence!P90","v":0},0,0,0,{"$f":"evidence!Q90","v":"00:00:00"},1900,2016,0,{"$f":"evidence!S90","v":0},"",null,{"$f":"evidence!F90","v":0},{"$f":"evidence!K90","v":0},null,null,null,0,0,0,0,0,0,0,0,0,0,0,0,0,0,0,0,0,0,0,0,0,null,null,null,null,null,0,0,0,0,0,"RODNE_CISLO",0,0,null,null,null,0,0,0,0,"","",0,0,0,0,0,0,null,null,null,null,null,null,null,null,null,null,null,null,null,null,null,null,null,null,null,null,null,null,null,null,null,null,null,null,null,"","","",null,null,"RODNE_CISLO","","",null,null,null,null,null,null,"","",null,null,"",null,"",null,null,null,""]
[{"$f":"evidence!A91","v":0},{"$f":"IF(ISTEXT(evidence!B91),evidence!B91,\"\")","v":""},{"$f":"evidence!C91","v":0},{"$f":"evidence!D91","v":0},1918,{"$f":"evidence!E91","v":0},{"$f":"evidence!L91","v":0},{"$f":"evidence!M91","v":0},{"$f":"evidence!N91","v":0},{"$f":"evidence!O91","v":0},{"$f":"evidence!P91","v":0},0,0,0,{"$f":"evidence!Q91","v":"00:00:00"},1900,2016,0,{"$f":"evidence!S91","v":0},"",null,{"$f":"evidence!F91","v":0},{"$f":"evidence!K91","v":0},null,null,null,0,0,0,0,0,0,0,0,0,0,0,0,0,0,0,0,0,0,0,0,0,null,null,null,null,null,0,0,0,0,0,"RODNE_CISLO",0,0,null,null,null,0,0,0,0,"","",0,0,0,0,0,0,null,null,null,null,null,null,null,null,null,null,null,null,null,null,null,null,null,null,null,null,null,null,null,null,null,null,null,null,null,"","","",null,null,"RODNE_CISLO","","",null,null,null,null,null,null,"","",null,null,"",null,"",null,null,null,""]
[{"$f":"evidence!A92","v":0},{"$f":"IF(ISTEXT(evidence!B92),evidence!B92,\"\")","v":""},{"$f":"evidence!C92","v":0},{"$f":"evidence!D92","v":0},1918,{"$f":"evidence!E92","v":0},{"$f":"evidence!L92","v":0},{"$f":"evidence!M92","v":0},{"$f":"evidence!N92","v":0},{"$f":"evidence!O92","v":0},{"$f":"evidence!P92","v":0},0,0,0,{"$f":"evidence!Q92","v":"00:00:00"},1900,2016,0,{"$f":"evidence!S92","v":0},"",null,{"$f":"evidence!F92","v":0},{"$f":"evidence!K92","v":0},null,null,null,0,0,0,0,0,0,0,0,0,0,0,0,0,0,0,0,0,0,0,0,0,null,null,null,null,null,0,0,0,0,0,"RODNE_CISLO",0,0,null,null,null,0,0,0,0,"","",0,0,0,0,0,0,null,null,null,null,null,null,null,null,null,null,null,null,null,null,null,null,null,null,null,null,null,null,null,null,null,null,null,null,null,"","","",null,null,"RODNE_CISLO","","",null,null,null,null,null,null,"","",null,null,"",null,"",null,null,null,""]
[{"$f":"evidence!A93","v":0},{"$f":"IF(ISTEXT(evidence!B93),evidence!B93,\"\")","v":""},{"$f":"evidence!C93","v":0},{"$f":"evidence!D93","v":0},1918,{"$f":"evidence!E93","v":0},{"$f":"evidence!L93","v":0},{"$f":"evidence!M93","v":0},{"$f":"evidence!N93","v":0},{"$f":"evidence!O93","v":0},{"$f":"evidence!P93","v":0},0,0,0,{"$f":"evidence!Q93","v":"00:00:00"},1900,2016,0,{"$f":"evidence!S93","v":0},"",null,{"$f":"evidence!F93","v":0},{"$f":"evidence!K93","v":0},null,null,null,0,0,0,0,0,0,0,0,0,0,0,0,0,0,0,0,0,0,0,0,0,null,null,null,null,null,0,0,0,0,0,"RODNE_CISLO",0,0,null,null,null,0,0,0,0,"","",0,0,0,0,0,0,null,null,null,null,null,null,null,null,null,null,null,null,null,null,null,null,null,null,null,null,null,null,null,null,null,null,null,null,null,"","","",null,null,"RODNE_CISLO","","",null,null,null,null,null,null,"","",null,null,"",null,"",null,null,null,""]
[{"$f":"evidence!A94","v":0},{"$f":"IF(ISTEXT(evidence!B94),evidence!B94,\"\")","v":""},{"$f":"evidence!C94","v":0},{"$f":"evidence!D94","v":0},1918,{"$f":"evidence!E94","v":0},{"$f":"evidence!L94","v":0},{"$f":"evidence!M94","v":0},{"$f":"evidence!N94","v":0},{"$f":"evidence!O94","v":0},{"$f":"evidence!P94","v":0},0,0,0,{"$f":"evidence!Q94","v":"00:00:00"},1900,2016,0,{"$f":"evidence!S94","v":0},"",null,{"$f":"evidence!F94","v":0},{"$f":"evidence!K94","v":0},null,null,null,0,0,0,0,0,0,0,0,0,0,0,0,0,0,0,0,0,0,0,0,0,null,null,null,null,null,0,0,0,0,0,"RODNE_CISLO",0,0,null,null,null,0,0,0,0,"","",0,0,0,0,0,0,null,null,null,null,null,null,null,null,null,null,null,null,null,null,null,null,null,null,null,null,null,null,null,null,null,null,null,null,null,"","","",null,null,"RODNE_CISLO","","",null,null,null,null,null,null,"","",null,null,"",null,"",null,null,null,""]
[{"$f":"evidence!A95","v":0},{"$f":"IF(ISTEXT(evidence!B95),evidence!B95,\"\")","v":""},{"$f":"evidence!C95","v":0},{"$f":"evidence!D95","v":0},1918,{"$f":"evidence!E95","v":0},{"$f":"evidence!L95","v":0},{"$f":"evidence!M95","v":0},{"$f":"evidence!N95","v":0},{"$f":"evidence!O95","v":0},{"$f":"evidence!P95","v":0},0,0,0,{"$f":"evidence!Q95","v":"00:00:00"},1900,2016,0,{"$f":"evidence!S95","v":0},"",null,{"$f":"evidence!F95","v":0},{"$f":"evidence!K95","v":0},null,null,null,0,0,0,0,0,0,0,0,0,0,0,0,0,0,0,0,0,0,0,0,0,null,null,null,null,null,0,0,0,0,0,"RODNE_CISLO",0,0,null,null,null,0,0,0,0,"","",0,0,0,0,0,0,null,null,null,null,null,null,null,null,null,null,null,null,null,null,null,null,null,null,null,null,null,null,null,null,null,null,null,null,null,"","","",null,null,"RODNE_CISLO","","",null,null,null,null,null,null,"","",null,null,"",null,"",null,null,null,""]
[{"$f":"evidence!A96","v":0},{"$f":"IF(ISTEXT(evidence!B96),evidence!B96,\"\")","v":""},{"$f":"evidence!C96","v":0},{"$f":"evidence!D96","v":0},1918,{"$f":"evidence!E96","v":0},{"$f":"evidence!L96","v":0},{"$f":"evidence!M96","v":0},{"$f":"evidence!N96","v":0},{"$f":"evidence!O96","v":0},{"$f":"evidence!P96","v":0},0,0,0,{"$f":"evidence!Q96","v":"00:00:00"},1900,2016,0,{"$f":"evidence!S96","v":0},"",null,{"$f":"evidence!F96","v":0},{"$f":"evidence!K96","v":0},null,null,null,0,0,0,0,0,0,0,0,0,0,0,0,0,0,0,0,0,0,0,0,0,null,null,null,null,null,0,0,0,0,0,"RODNE_CISLO",0,0,null,null,null,0,0,0,0,"","",0,0,0,0,0,0,null,null,null,null,null,null,null,null,null,null,null,null,null,null,null,null,null,null,null,null,null,null,null,null,null,null,null,null,null,"","","",null,null,"RODNE_CISLO","","",null,null,null,null,null,null,"","",null,null,"",null,"",null,null,null,""]
[{"$f":"evidence!A97","v":0},{"$f":"IF(ISTEXT(evidence!B97),evidence!B97,\"\")","v":""},{"$f":"evidence!C97","v":0},{"$f":"evidence!D97","v":0},1918,{"$f":"evidence!E97","v":0},{"$f":"evidence!L97","v":0},{"$f":"evidence!M97","v":0},{"$f":"evidence!N97","v":0},{"$f":"evidence!O97","v":0},{"$f":"evidence!P97","v":0},0,0,0,{"$f":"evidence!Q97","v":"00:00:00"},1900,2016,0,{"$f":"evidence!S97","v":0},"",null,{"$f":"evidence!F97","v":0},{"$f":"evidence!K97","v":0},null,null,null,0,0,0,0,0,0,0,0,0,0,0,0,0,0,0,0,0,0,0,0,0,null,null,null,null,null,0,0,0,0,0,"RODNE_CISLO",0,0,null,null,null,0,0,0,0,"","",0,0,0,0,0,0,null,null,null,null,null,null,null,null,null,null,null,null,null,null,null,null,null,null,null,null,null,null,null,null,null,null,null,null,null,"","","",null,null,"RODNE_CISLO","","",null,null,null,null,null,null,"","",null,null,"",null,"",null,null,null,""]
[{"$f":"evidence!A98","v":0},{"$f":"IF(ISTEXT(evidence!B98),evidence!B98,\"\")","v":""},{"$f":"evidence!C98","v":0},{"$f":"evidence!D98","v":0},1918,{"$f":"evidence!E98","v":0},{"$f":"evidence!L98","v":0},{"$f":"evidence!M98","v":0},{"$f":"evidence!N98","v":0},{"$f":"evidence!O98","v":0},{"$f":"evidence!P98","v":0},0,0,0,{"$f":"evidence!Q98","v":"00:00:00"},1900,2016,0,{"$f":"evidence!S98","v":0},"",null,{"$f":"evidence!F98","v":0},{"$f":"evidence!K98","v":0},null,null,null,0,0,0,0,0,0,0,0,0,0,0,0,0,0,0,0,0,0,0,0,0,null,null,null,null,null,0,0,0,0,0,"RODNE_CISLO",0,0,null,null,null,0,0,0,0,"","",0,0,0,0,0,0,null,null,null,null,null,null,null,null,null,null,null,null,null,null,null,null,null,null,null,null,null,null,null,null,null,null,null,null,null,"","","",null,null,"RODNE_CISLO","","",null,null,null,null,null,null,"","",null,null,"",null,"",null,null,null,""]
[{"$f":"evidence!A99","v":0},{"$f":"IF(ISTEXT(evidence!B99),evidence!B99,\"\")","v":""},{"$f":"evidence!C99","v":0},{"$f":"evidence!D99","v":0},1918,{"$f":"evidence!E99","v":0},{"$f":"evidence!L99","v":0},{"$f":"evidence!M99","v":0},{"$f":"evidence!N99","v":0},{"$f":"evidence!O99","v":0},{"$f":"evidence!P99","v":0},0,0,0,{"$f":"evidence!Q99","v":"00:00:00"},1900,2016,0,{"$f":"evidence!S99","v":0},"",null,{"$f":"evidence!F99","v":0},{"$f":"evidence!K99","v":0},null,null,null,0,0,0,0,0,0,0,0,0,0,0,0,0,0,0,0,0,0,0,0,0,null,null,null,null,null,0,0,0,0,0,"RODNE_CISLO",0,0,null,null,null,0,0,0,0,"","",0,0,0,0,0,0,null,null,null,null,null,null,null,null,null,null,null,null,null,null,null,null,null,null,null,null,null,null,null,null,null,null,null,null,null,"","","",null,null,"RODNE_CISLO","","",null,null,null,null,null,null,"","",null,null,"",null,"",null,null,null,""]
[{"$f":"evidence!A100","v":0},{"$f":"IF(ISTEXT(evidence!B100),evidence!B100,\"\")","v":""},{"$f":"evidence!C100","v":0},{"$f":"evidence!D100","v":0},1918,{"$f":"evidence!E100","v":0},{"$f":"evidence!L100","v":0},{"$f":"evidence!M100","v":0},{"$f":"evidence!N100","v":0},{"$f":"evidence!O100","v":0},{"$f":"evidence!P100","v":0},0,0,0,{"$f":"evidence!Q100","v":"00:00:00"},1900,2016,0,{"$f":"evidence!S100","v":0},"",null,{"$f":"evidence!F100","v":0},{"$f":"evidence!K100","v":0},null,null,null,0,0,0,0,0,0,0,0,0,0,0,0,0,0,0,0,0,0,0,0,0,null,null,null,null,null,0,0,0,0,0,"RODNE_CISLO",0,0,null,null,null,0,0,0,0,"","",0,0,0,0,0,0,null,null,null,null,null,null,null,null,null,null,null,null,null,null,null,null,null,null,null,null,null,null,null,null,null,null,null,null,null,"","","",null,null,"RODNE_CISLO","","",null,null,null,null,null,null,"","",null,null,"",null,"",null,null,null,""]
[{"$f":"evidence!A101","v":0},{"$f":"IF(ISTEXT(evidence!B101),evidence!B101,\"\")","v":""},{"$f":"evidence!C101","v":0},{"$f":"evidence!D101","v":0},1918,{"$f":"evidence!E101","v":0},{"$f":"evidence!L101","v":0},{"$f":"evidence!M101","v":0},{"$f":"evidence!N101","v":0},{"$f":"evidence!O101","v":0},{"$f":"evidence!P101","v":0},0,0,0,{"$f":"evidence!Q101","v":"00:00:00"},1900,2016,0,{"$f":"evidence!S101","v":0},"",null,{"$f":"evidence!F101","v":0},{"$f":"evidence!K101","v":0},null,null,null,0,0,0,0,0,0,0,0,0,0,0,0,0,0,0,0,0,0,0,0,0,null,null,null,null,null,0,0,0,0,0,"RODNE_CISLO",0,0,null,null,null,0,0,0,0,"","",0,0,0,0,0,0,null,null,null,null,null,null,null,null,null,null,null,null,null,null,null,null,null,null,null,null,null,null,null,null,null,null,null,null,null,"","","",null,null,"RODNE_CISLO","","",null,null,null,null,null,null,"","",null,null,"",null,"",null,null,null,""]
[{"$f":"evidence!A102","v":0},{"$f":"IF(ISTEXT(evidence!B102),evidence!B102,\"\")","v":""},{"$f":"evidence!C102","v":0},{"$f":"evidence!D102","v":0},1918,{"$f":"evidence!E102","v":0},{"$f":"evidence!L102","v":0},{"$f":"evidence!M102","v":0},{"$f":"evidence!N102","v":0},{"$f":"evidence!O102","v":0},{"$f":"evidence!P102","v":0},0,0,0,{"$f":"evidence!Q102","v":"00:00:00"},1900,2016,0,{"$f":"evidence!S102","v":0},"",null,{"$f":"evidence!F102","v":0},{"$f":"evidence!K102","v":0},null,null,null,0,0,0,0,0,0,0,0,0,0,0,0,0,0,0,0,0,0,0,0,0,null,null,null,null,null,0,0,0,0,0,"RODNE_CISLO",0,0,null,null,null,0,0,0,0,"","",0,0,0,0,0,0,null,null,null,null,null,null,null,null,null,null,null,null,null,null,null,null,null,null,null,null,null,null,null,null,null,null,null,null,null,"","","",null,null,"RODNE_CISLO","","",null,null,null,null,null,null,"","",null,null,"",null,"",null,null,null,""]
[{"$f":"evidence!A103","v":0},{"$f":"IF(ISTEXT(evidence!B103),evidence!B103,\"\")","v":""},{"$f":"evidence!C103","v":0},{"$f":"evidence!D103","v":0},1918,{"$f":"evidence!E103","v":0},{"$f":"evidence!L103","v":0},{"$f":"evidence!M103","v":0},{"$f":"evidence!N103","v":0},{"$f":"evidence!O103","v":0},{"$f":"evidence!P103","v":0},0,0,0,{"$f":"evidence!Q103","v":"00:00:00"},1900,2016,0,{"$f":"evidence!S103","v":0},"",null,{"$f":"evidence!F103","v":0},{"$f":"evidence!K103","v":0},null,null,null,0,0,0,0,0,0,0,0,0,0,0,0,0,0,0,0,0,0,0,0,0,null,null,null,null,null,0,0,0,0,0,"RODNE_CISLO",0,0,null,null,null,0,0,0,0,"","",0,0,0,0,0,0,null,null,null,null,null,null,null,null,null,null,null,null,null,null,null,null,null,null,null,null,null,null,null,null,null,null,null,null,null,"","","",null,null,"RODNE_CISLO","","",null,null,null,null,null,null,"","",null,null,"",null,"",null,null,null,""]
[{"$f":"evidence!A104","v":0},{"$f":"IF(ISTEXT(evidence!B104),evidence!B104,\"\")","v":""},{"$f":"evidence!C104","v":0},{"$f":"evidence!D104","v":0},1918,{"$f":"evidence!E104","v":0},{"$f":"evidence!L104","v":0},{"$f":"evidence!M104","v":0},{"$f":"evidence!N104","v":0},{"$f":"evidence!O104","v":0},{"$f":"evidence!P104","v":0},0,0,0,{"$f":"evidence!Q104","v":"00:00:00"},1900,2016,0,{"$f":"evidence!S104","v":0},"",null,{"$f":"evidence!F104","v":0},{"$f":"evidence!K104","v":0},null,null,null,0,0,0,0,0,0,0,0,0,0,0,0,0,0,0,0,0,0,0,0,0,null,null,null,null,null,0,0,0,0,0,"RODNE_CISLO",0,0,null,null,null,0,0,0,0,"","",0,0,0,0,0,0,null,null,null,null,null,null,null,null,null,null,null,null,null,null,null,null,null,null,null,null,null,null,null,null,null,null,null,null,null,"","","",null,null,"RODNE_CISLO","","",null,null,null,null,null,null,"","",null,null,"",null,"",null,null,null,""]
[{"$f":"evidence!A105","v":0},{"$f":"IF(ISTEXT(evidence!B105),evidence!B105,\"\")","v":""},{"$f":"evidence!C105","v":0},{"$f":"evidence!D105","v":0},1918,{"$f":"evidence!E105","v":0},{"$f":"evidence!L105","v":0},{"$f":"evidence!M105","v":0},{"$f":"evidence!N105","v":0},{"$f":"evidence!O105","v":0},{"$f":"evidence!P105","v":0},0,0,0,{"$f":"evidence!Q105","v":"00:00:00"},1900,2016,0,{"$f":"evidence!S105","v":0},"",null,{"$f":"evidence!F105","v":0},{"$f":"evidence!K105","v":0},null,null,null,0,0,0,0,0,0,0,0,0,0,0,0,0,0,0,0,0,0,0,0,0,null,null,null,null,null,0,0,0,0,0,"RODNE_CISLO",0,0,null,null,null,0,0,0,0,"","",0,0,0,0,0,0,null,null,null,null,null,null,null,null,null,null,null,null,null,null,null,null,null,null,null,null,null,null,null,null,null,null,null,null,null,"","","",null,null,"RODNE_CISLO","","",null,null,null,null,null,null,"","",null,null,"",null,"",null,null,null,""]
[{"$f":"evidence!A106","v":0},{"$f":"IF(ISTEXT(evidence!B106),evidence!B106,\"\")","v":""},{"$f":"evidence!C106","v":0},{"$f":"evidence!D106","v":0},1918,{"$f":"evidence!E106","v":0},{"$f":"evidence!L106","v":0},{"$f":"evidence!M106","v":0},{"$f":"evidence!N106","v":0},{"$f":"evidence!O106","v":0},{"$f":"evidence!P106","v":0},0,0,0,{"$f":"evidence!Q106","v":"00:00:00"},1900,2016,0,{"$f":"evidence!S106","v":0},"",null,{"$f":"evidence!F106","v":0},{"$f":"evidence!K106","v":0},null,null,null,0,0,0,0,0,0,0,0,0,0,0,0,0,0,0,0,0,0,0,0,0,null,null,null,null,null,0,0,0,0,0,"RODNE_CISLO",0,0,null,null,null,0,0,0,0,"","",0,0,0,0,0,0,null,null,null,null,null,null,null,null,null,null,null,null,null,null,null,null,null,null,null,null,null,null,null,null,null,null,null,null,null,"","","",null,null,"RODNE_CISLO","","",null,null,null,null,null,null,"","",null,null,"",null,"",null,null,null,""]
[{"$f":"evidence!A107","v":0},{"$f":"IF(ISTEXT(evidence!B107),evidence!B107,\"\")","v":""},{"$f":"evidence!C107","v":0},{"$f":"evidence!D107","v":0},1918,{"$f":"evidence!E107","v":0},{"$f":"evidence!L107","v":0},{"$f":"evidence!M107","v":0},{"$f":"evidence!N107","v":0},{"$f":"evidence!O107","v":0},{"$f":"evidence!P107","v":0},0,0,0,{"$f":"evidence!Q107","v":"00:00:00"},1900,2016,0,{"$f":"evidence!S107","v":0},"",null,{"$f":"evidence!F107","v":0},{"$f":"evidence!K107","v":0},null,null,null,0,0,0,0,0,0,0,0,0,0,0,0,0,0,0,0,0,0,0,0,0,null,null,null,null,null,0,0,0,0,0,"RODNE_CISLO",0,0,null,null,null,0,0,0,0,"","",0,0,0,0,0,0,null,null,null,null,null,null,null,null,null,null,null,null,null,null,null,null,null,null,null,null,null,null,null,null,null,null,null,null,null,"","","",null,null,"RODNE_CISLO","","",null,null,null,null,null,null,"","",null,null,"",null,"",null,null,null,""]
[{"$f":"evidence!A108","v":0},{"$f":"IF(ISTEXT(evidence!B108),evidence!B108,\"\")","v":""},{"$f":"evidence!C108","v":0},{"$f":"evidence!D108","v":0},1918,{"$f":"evidence!E108","v":0},{"$f":"evidence!L108","v":0},{"$f":"evidence!M108","v":0},{"$f":"evidence!N108","v":0},{"$f":"evidence!O108","v":0},{"$f":"evidence!P108","v":0},0,0,0,{"$f":"evidence!Q108","v":"00:00:00"},1900,2016,0,{"$f":"evidence!S108","v":0},"",null,{"$f":"evidence!F108","v":0},{"$f":"evidence!K108","v":0},null,null,null,0,0,0,0,0,0,0,0,0,0,0,0,0,0,0,0,0,0,0,0,0,null,null,null,null,null,0,0,0,0,0,"RODNE_CISLO",0,0,null,null,null,0,0,0,0,"","",0,0,0,0,0,0,null,null,null,null,null,null,null,null,null,null,null,null,null,null,null,null,null,null,null,null,null,null,null,null,null,null,null,null,null,"","","",null,null,"RODNE_CISLO","","",null,null,null,null,null,null,"","",null,null,"",null,"",null,null,null,""]
[{"$f":"evidence!A109","v":0},{"$f":"IF(ISTEXT(evidence!B109),evidence!B109,\"\")","v":""},{"$f":"evidence!C109","v":0},{"$f":"evidence!D109","v":0},1918,{"$f":"evidence!E109","v":0},{"$f":"evidence!L109","v":0},{"$f":"evidence!M109","v":0},{"$f":"evidence!N109","v":0},{"$f":"evidence!O109","v":0},{"$f":"evidence!P109","v":0},0,0,0,{"$f":"evidence!Q109","v":"00:00:00"},1900,2016,0,{"$f":"evidence!S109","v":0},"",null,{"$f":"evidence!F109","v":0},{"$f":"evidence!K109","v":0},null,null,null,0,0,0,0,0,0,0,0,0,0,0,0,0,0,0,0,0,0,0,0,0,null,null,null,null,null,0,0,0,0,0,"RODNE_CISLO",0,0,null,null,null,0,0,0,0,"","",0,0,0,0,0,0,null,null,null,null,null,null,null,null,null,null,null,null,null,null,null,null,null,null,null,null,null,null,null,null,null,null,null,null,null,"","","",null,null,"RODNE_CISLO","","",null,null,null,null,null,null,"","",null,null,"",null,"",null,null,null,""]
[{"$f":"evidence!A110","v":0},{"$f":"IF(ISTEXT(evidence!B110),evidence!B110,\"\")","v":""},{"$f":"evidence!C110","v":0},{"$f":"evidence!D110","v":0},1918,{"$f":"evidence!E110","v":0},{"$f":"evidence!L110","v":0},{"$f":"evidence!M110","v":0},{"$f":"evidence!N110","v":0},{"$f":"evidence!O110","v":0},{"$f":"evidence!P110","v":0},0,0,0,{"$f":"evidence!Q110","v":"00:00:00"},1900,2016,0,{"$f":"evidence!S110","v":0},"",null,{"$f":"evidence!F110","v":0},{"$f":"evidence!K110","v":0},null,null,null,0,0,0,0,0,0,0,0,0,0,0,0,0,0,0,0,0,0,0,0,0,null,null,null,null,null,0,0,0,0,0,"RODNE_CISLO",0,0,null,null,null,0,0,0,0,"","",0,0,0,0,0,0,null,null,null,null,null,null,null,null,null,null,null,null,null,null,null,null,null,null,null,null,null,null,null,null,null,null,null,null,null,"","","",null,null,"RODNE_CISLO","","",null,null,null,null,null,null,"","",null,null,"",null,"",null,null,null,""]
[{"$f":"evidence!A111","v":0},{"$f":"IF(ISTEXT(evidence!B111),evidence!B111,\"\")","v":""},{"$f":"evidence!C111","v":0},{"$f":"evidence!D111","v":0},1918,{"$f":"evidence!E111","v":0},{"$f":"evidence!L111","v":0},{"$f":"evidence!M111","v":0},{"$f":"evidence!N111","v":0},{"$f":"evidence!O111","v":0},{"$f":"evidence!P111","v":0},0,0,0,{"$f":"evidence!Q111","v":"00:00:00"},1900,2016,0,{"$f":"evidence!S111","v":0},"",null,{"$f":"evidence!F111","v":0},{"$f":"evidence!K111","v":0},null,null,null,0,0,0,0,0,0,0,0,0,0,0,0,0,0,0,0,0,0,0,0,0,null,null,null,null,null,0,0,0,0,0,"RODNE_CISLO",0,0,null,null,null,0,0,0,0,"","",0,0,0,0,0,0,null,null,null,null,null,null,null,null,null,null,null,null,null,null,null,null,null,null,null,null,null,null,null,null,null,null,null,null,null,"","","",null,null,"RODNE_CISLO","","",null,null,null,null,null,null,"","",null,null,"",null,"",null,null,null,""]
[{"$f":"evidence!A112","v":0},{"$f":"IF(ISTEXT(evidence!B112),evidence!B112,\"\")","v":""},{"$f":"evidence!C112","v":0},{"$f":"evidence!D112","v":0},1918,{"$f":"evidence!E112","v":0},{"$f":"evidence!L112","v":0},{"$f":"evidence!M112","v":0},{"$f":"evidence!N112","v":0},{"$f":"evidence!O112","v":0},{"$f":"evidence!P112","v":0},0,0,0,{"$f":"evidence!Q112","v":"00:00:00"},1900,2016,0,{"$f":"evidence!S112","v":0},"",null,{"$f":"evidence!F112","v":0},{"$f":"evidence!K112","v":0},null,null,null,0,0,0,0,0,0,0,0,0,0,0,0,0,0,0,0,0,0,0,0,0,null,null,null,null,null,0,0,0,0,0,"RODNE_CISLO",0,0,null,null,null,0,0,0,0,"","",0,0,0,0,0,0,null,null,null,null,null,null,null,null,null,null,null,null,null,null,null,null,null,null,null,null,null,null,null,null,null,null,null,null,null,"","","",null,null,"RODNE_CISLO","","",null,null,null,null,null,null,"","",null,null,"",null,"",null,null,null,""]
[{"$f":"evidence!A113","v":0},{"$f":"IF(ISTEXT(evidence!B113),evidence!B113,\"\")","v":""},{"$f":"evidence!C113","v":0},{"$f":"evidence!D113","v":0},1918,{"$f":"evidence!E113","v":0},{"$f":"evidence!L113","v":0},{"$f":"evidence!M113","v":0},{"$f":"evidence!N113","v":0},{"$f":"evidence!O113","v":0},{"$f":"evidence!P113","v":0},0,0,0,{"$f":"evidence!Q113","v":"00:00:00"},1900,2016,0,{"$f":"evidence!S113","v":0},"",null,{"$f":"evidence!F113","v":0},{"$f":"evidence!K113","v":0},null,null,null,0,0,0,0,0,0,0,0,0,0,0,0,0,0,0,0,0,0,0,0,0,null,null,null,null,null,0,0,0,0,0,"RODNE_CISLO",0,0,null,null,null,0,0,0,0,"","",0,0,0,0,0,0,null,null,null,null,null,null,null,null,null,null,null,null,null,null,null,null,null,null,null,null,null,null,null,null,null,null,null,null,null,"","","",null,null,"RODNE_CISLO","","",null,null,null,null,null,null,"","",null,null,"",null,"",null,null,null,""]
[{"$f":"evidence!A114","v":0},{"$f":"IF(ISTEXT(evidence!B114),evidence!B114,\"\")","v":""},{"$f":"evidence!C114","v":0},{"$f":"evidence!D114","v":0},1918,{"$f":"evidence!E114","v":0},{"$f":"evidence!L114","v":0},{"$f":"evidence!M114","v":0},{"$f":"evidence!N114","v":0},{"$f":"evidence!O114","v":0},{"$f":"evidence!P114","v":0},0,0,0,{"$f":"evidence!Q114","v":"00:00:00"},1900,2016,0,{"$f":"evidence!S114","v":0},"",null,{"$f":"evidence!F114","v":0},{"$f":"evidence!K114","v":0},null,null,null,0,0,0,0,0,0,0,0,0,0,0,0,0,0,0,0,0,0,0,0,0,null,null,null,null,null,0,0,0,0,0,"RODNE_CISLO",0,0,null,null,null,0,0,0,0,"","",0,0,0,0,0,0,null,null,null,null,null,null,null,null,null,null,null,null,null,null,null,null,null,null,null,null,null,null,null,null,null,null,null,null,null,"","","",null,null,"RODNE_CISLO","","",null,null,null,null,null,null,"","",null,null,"",null,"",null,null,null,""]
[{"$f":"evidence!A115","v":0},{"$f":"IF(ISTEXT(evidence!B115),evidence!B115,\"\")","v":""},{"$f":"evidence!C115","v":0},{"$f":"evidence!D115","v":0},1918,{"$f":"evidence!E115","v":0},{"$f":"evidence!L115","v":0},{"$f":"evidence!M115","v":0},{"$f":"evidence!N115","v":0},{"$f":"evidence!O115","v":0},{"$f":"evidence!P115","v":0},0,0,0,{"$f":"evidence!Q115","v":"00:00:00"},1900,2016,0,{"$f":"evidence!S115","v":0},"",null,{"$f":"evidence!F115","v":0},{"$f":"evidence!K115","v":0},null,null,null,0,0,0,0,0,0,0,0,0,0,0,0,0,0,0,0,0,0,0,0,0,null,null,null,null,null,0,0,0,0,0,"RODNE_CISLO",0,0,null,null,null,0,0,0,0,"","",0,0,0,0,0,0,null,null,null,null,null,null,null,null,null,null,null,null,null,null,null,null,null,null,null,null,null,null,null,null,null,null,null,null,null,"","","",null,null,"RODNE_CISLO","","",null,null,null,null,null,null,"","",null,null,"",null,"",null,null,null,""]
[{"$f":"evidence!A116","v":0},{"$f":"IF(ISTEXT(evidence!B116),evidence!B116,\"\")","v":""},{"$f":"evidence!C116","v":0},{"$f":"evidence!D116","v":0},1918,{"$f":"evidence!E116","v":0},{"$f":"evidence!L116","v":0},{"$f":"evidence!M116","v":0},{"$f":"evidence!N116","v":0},{"$f":"evidence!O116","v":0},{"$f":"evidence!P116","v":0},0,0,0,{"$f":"evidence!Q116","v":"00:00:00"},1900,2016,0,{"$f":"evidence!S116","v":0},"",null,{"$f":"evidence!F116","v":0},{"$f":"evidence!K116","v":0},null,null,null,0,0,0,0,0,0,0,0,0,0,0,0,0,0,0,0,0,0,0,0,0,null,null,null,null,null,0,0,0,0,0,"RODNE_CISLO",0,0,null,null,null,0,0,0,0,"","",0,0,0,0,0,0,null,null,null,null,null,null,null,null,null,null,null,null,null,null,null,null,null,null,null,null,null,null,null,null,null,null,null,null,null,"","","",null,null,"RODNE_CISLO","","",null,null,null,null,null,null,"","",null,null,"",null,"",null,null,null,""]
[{"$f":"evidence!A117","v":0},{"$f":"IF(ISTEXT(evidence!B117),evidence!B117,\"\")","v":""},{"$f":"evidence!C117","v":0},{"$f":"evidence!D117","v":0},1918,{"$f":"evidence!E117","v":0},{"$f":"evidence!L117","v":0},{"$f":"evidence!M117","v":0},{"$f":"evidence!N117","v":0},{"$f":"evidence!O117","v":0},{"$f":"evidence!P117","v":0},0,0,0,{"$f":"evidence!Q117","v":"00:00:00"},1900,2016,0,{"$f":"evidence!S117","v":0},"",null,{"$f":"evidence!F117","v":0},{"$f":"evidence!K117","v":0},null,null,null,0,0,0,0,0,0,0,0,0,0,0,0,0,0,0,0,0,0,0,0,0,null,null,null,null,null,0,0,0,0,0,"RODNE_CISLO",0,0,null,null,null,0,0,0,0,"","",0,0,0,0,0,0,null,null,null,null,null,null,null,null,null,null,null,null,null,null,null,null,null,null,null,null,null,null,null,null,null,null,null,null,null,"","","",null,null,"RODNE_CISLO","","",null,null,null,null,null,null,"","",null,null,"",null,"",null,null,null,""]
[{"$f":"evidence!A118","v":0},{"$f":"IF(ISTEXT(evidence!B118),evidence!B118,\"\")","v":""},{"$f":"evidence!C118","v":0},{"$f":"evidence!D118","v":0},1918,{"$f":"evidence!E118","v":0},{"$f":"evidence!L118","v":0},{"$f":"evidence!M118","v":0},{"$f":"evidence!N118","v":0},{"$f":"evidence!O118","v":0},{"$f":"evidence!P118","v":0},0,0,0,{"$f":"evidence!Q118","v":"00:00:00"},1900,2016,0,{"$f":"evidence!S118","v":0},"",null,{"$f":"evidence!F118","v":0},{"$f":"evidence!K118","v":0},null,null,null,0,0,0,0,0,0,0,0,0,0,0,0,0,0,0,0,0,0,0,0,0,null,null,null,null,null,0,0,0,0,0,"RODNE_CISLO",0,0,null,null,null,0,0,0,0,"","",0,0,0,0,0,0,null,null,null,null,null,null,null,null,null,null,null,null,null,null,null,null,null,null,null,null,null,null,null,null,null,null,null,null,null,"","","",null,null,"RODNE_CISLO","","",null,null,null,null,null,null,"","",null,null,"",null,"",null,null,null,""]
[{"$f":"evidence!A119","v":0},{"$f":"IF(ISTEXT(evidence!B119),evidence!B119,\"\")","v":""},{"$f":"evidence!C119","v":0},{"$f":"evidence!D119","v":0},1918,{"$f":"evidence!E119","v":0},{"$f":"evidence!L119","v":0},{"$f":"evidence!M119","v":0},{"$f":"evidence!N119","v":0},{"$f":"evidence!O119","v":0},{"$f":"evidence!P119","v":0},0,0,0,{"$f":"evidence!Q119","v":"00:00:00"},1900,2016,0,{"$f":"evidence!S119","v":0},"",null,{"$f":"evidence!F119","v":0},{"$f":"evidence!K119","v":0},null,null,null,0,0,0,0,0,0,0,0,0,0,0,0,0,0,0,0,0,0,0,0,0,null,null,null,null,null,0,0,0,0,0,"RODNE_CISLO",0,0,null,null,null,0,0,0,0,"","",0,0,0,0,0,0,null,null,null,null,null,null,null,null,null,null,null,null,null,null,null,null,null,null,null,null,null,null,null,null,null,null,null,null,null,"","","",null,null,"RODNE_CISLO","","",null,null,null,null,null,null,"","",null,null,"",null,"",null,null,null,""]
[{"$f":"evidence!A120","v":0},{"$f":"IF(ISTEXT(evidence!B120),evidence!B120,\"\")","v":""},{"$f":"evidence!C120","v":0},{"$f":"evidence!D120","v":0},1918,{"$f":"evidence!E120","v":0},{"$f":"evidence!L120","v":0},{"$f":"evidence!M120","v":0},{"$f":"evidence!N120","v":0},{"$f":"evidence!O120","v":0},{"$f":"evidence!P120","v":0},0,0,0,{"$f":"evidence!Q120","v":"00:00:00"},1900,2016,0,{"$f":"evidence!S120","v":0},"",null,{"$f":"evidence!F120","v":0},{"$f":"evidence!K120","v":0},null,null,null,0,0,0,0,0,0,0,0,0,0,0,0,0,0,0,0,0,0,0,0,0,null,null,null,null,null,0,0,0,0,0,"RODNE_CISLO",0,0,null,null,null,0,0,0,0,"","",0,0,0,0,0,0,null,null,null,null,null,null,null,null,null,null,null,null,null,null,null,null,null,null,null,null,null,null,null,null,null,null,null,null,null,"","","",null,null,"RODNE_CISLO","","",null,null,null,null,null,null,"","",null,null,"",null,"",null,null,null,""]
[{"$f":"evidence!A121","v":0},{"$f":"IF(ISTEXT(evidence!B121),evidence!B121,\"\")","v":""},{"$f":"evidence!C121","v":0},{"$f":"evidence!D121","v":0},1918,{"$f":"evidence!E121","v":0},{"$f":"evidence!L121","v":0},{"$f":"evidence!M121","v":0},{"$f":"evidence!N121","v":0},{"$f":"evidence!O121","v":0},{"$f":"evidence!P121","v":0},0,0,0,{"$f":"evidence!Q121","v":"00:00:00"},1900,2016,0,{"$f":"evidence!S121","v":0},"",null,{"$f":"evidence!F121","v":0},{"$f":"evidence!K121","v":0},null,null,null,0,0,0,0,0,0,0,0,0,0,0,0,0,0,0,0,0,0,0,0,0,null,null,null,null,null,0,0,0,0,0,"RODNE_CISLO",0,0,null,null,null,0,0,0,0,"","",0,0,0,0,0,0,null,null,null,null,null,null,null,null,null,null,null,null,null,null,null,null,null,null,null,null,null,null,null,null,null,null,null,null,null,"","","",null,null,"RODNE_CISLO","","",null,null,null,null,null,null,"","",null,null,"",null,"",null,null,null,""]
[{"$f":"evidence!A122","v":0},{"$f":"IF(ISTEXT(evidence!B122),evidence!B122,\"\")","v":""},{"$f":"evidence!C122","v":0},{"$f":"evidence!D122","v":0},1918,{"$f":"evidence!E122","v":0},{"$f":"evidence!L122","v":0},{"$f":"evidence!M122","v":0},{"$f":"evidence!N122","v":0},{"$f":"evidence!O122","v":0},{"$f":"evidence!P122","v":0},0,0,0,{"$f":"evidence!Q122","v":"00:00:00"},1900,2016,0,{"$f":"evidence!S122","v":0},"",null,{"$f":"evidence!F122","v":0},{"$f":"evidence!K122","v":0},null,null,null,0,0,0,0,0,0,0,0,0,0,0,0,0,0,0,0,0,0,0,0,0,null,null,null,null,null,0,0,0,0,0,"RODNE_CISLO",0,0,null,null,null,0,0,0,0,"","",0,0,0,0,0,0,null,null,null,null,null,null,null,null,null,null,null,null,null,null,null,null,null,null,null,null,null,null,null,null,null,null,null,null,null,"","","",null,null,"RODNE_CISLO","","",null,null,null,null,null,null,"","",null,null,"",null,"",null,null,null,""]
[{"$f":"evidence!A123","v":0},{"$f":"IF(ISTEXT(evidence!B123),evidence!B123,\"\")","v":""},{"$f":"evidence!C123","v":0},{"$f":"evidence!D123","v":0},1918,{"$f":"evidence!E123","v":0},{"$f":"evidence!L123","v":0},{"$f":"evidence!M123","v":0},{"$f":"evidence!N123","v":0},{"$f":"evidence!O123","v":0},{"$f":"evidence!P123","v":0},0,0,0,{"$f":"evidence!Q123","v":"00:00:00"},1900,2016,0,{"$f":"evidence!S123","v":0},"",null,{"$f":"evidence!F123","v":0},{"$f":"evidence!K123","v":0},null,null,null,0,0,0,0,0,0,0,0,0,0,0,0,0,0,0,0,0,0,0,0,0,null,null,null,null,null,0,0,0,0,0,"RODNE_CISLO",0,0,null,null,null,0,0,0,0,"","",0,0,0,0,0,0,null,null,null,null,null,null,null,null,null,null,null,null,null,null,null,null,null,null,null,null,null,null,null,null,null,null,null,null,null,"","","",null,null,"RODNE_CISLO","","",null,null,null,null,null,null,"","",null,null,"",null,"",null,null,null,""]
[{"$f":"evidence!A124","v":0},{"$f":"IF(ISTEXT(evidence!B124),evidence!B124,\"\")","v":""},{"$f":"evidence!C124","v":0},{"$f":"evidence!D124","v":0},1918,{"$f":"evidence!E124","v":0},{"$f":"evidence!L124","v":0},{"$f":"evidence!M124","v":0},{"$f":"evidence!N124","v":0},{"$f":"evidence!O124","v":0},{"$f":"evidence!P124","v":0},0,0,0,{"$f":"evidence!Q124","v":"00:00:00"},1900,2016,0,{"$f":"evidence!S124","v":0},"",null,{"$f":"evidence!F124","v":0},{"$f":"evidence!K124","v":0},null,null,null,0,0,0,0,0,0,0,0,0,0,0,0,0,0,0,0,0,0,0,0,0,null,null,null,null,null,0,0,0,0,0,"RODNE_CISLO",0,0,null,null,null,0,0,0,0,"","",0,0,0,0,0,0,null,null,null,null,null,null,null,null,null,null,null,null,null,null,null,null,null,null,null,null,null,null,null,null,null,null,null,null,null,"","","",null,null,"RODNE_CISLO","","",null,null,null,null,null,null,"","",null,null,"",null,"",null,null,null,""]
[{"$f":"evidence!A125","v":0},{"$f":"IF(ISTEXT(evidence!B125),evidence!B125,\"\")","v":""},{"$f":"evidence!C125","v":0},{"$f":"evidence!D125","v":0},1918,{"$f":"evidence!E125","v":0},{"$f":"evidence!L125","v":0},{"$f":"evidence!M125","v":0},{"$f":"evidence!N125","v":0},{"$f":"evidence!O125","v":0},{"$f":"evidence!P125","v":0},0,0,0,{"$f":"evidence!Q125","v":"00:00:00"},1900,2016,0,{"$f":"evidence!S125","v":0},"",null,{"$f":"evidence!F125","v":0},{"$f":"evidence!K125","v":0},null,null,null,0,0,0,0,0,0,0,0,0,0,0,0,0,0,0,0,0,0,0,0,0,null,null,null,null,null,0,0,0,0,0,"RODNE_CISLO",0,0,null,null,null,0,0,0,0,"","",0,0,0,0,0,0,null,null,null,null,null,null,null,null,null,null,null,null,null,null,null,null,null,null,null,null,null,null,null,null,null,null,null,null,null,"","","",null,null,"RODNE_CISLO","","",null,null,null,null,null,null,"","",null,null,"",null,"",null,null,null,""]
[{"$f":"evidence!A126","v":0},{"$f":"IF(ISTEXT(evidence!B126),evidence!B126,\"\")","v":""},{"$f":"evidence!C126","v":0},{"$f":"evidence!D126","v":0},1918,{"$f":"evidence!E126","v":0},{"$f":"evidence!L126","v":0},{"$f":"evidence!M126","v":0},{"$f":"evidence!N126","v":0},{"$f":"evidence!O126","v":0},{"$f":"evidence!P126","v":0},0,0,0,{"$f":"evidence!Q126","v":"00:00:00"},1900,2016,0,{"$f":"evidence!S126","v":0},"",null,{"$f":"evidence!F126","v":0},{"$f":"evidence!K126","v":0},null,null,null,0,0,0,0,0,0,0,0,0,0,0,0,0,0,0,0,0,0,0,0,0,null,null,null,null,null,0,0,0,0,0,"RODNE_CISLO",0,0,null,null,null,0,0,0,0,"","",0,0,0,0,0,0,null,null,null,null,null,null,null,null,null,null,null,null,null,null,null,null,null,null,null,null,null,null,null,null,null,null,null,null,null,"","","",null,null,"RODNE_CISLO","","",null,null,null,null,null,null,"","",null,null,"",null,"",null,null,null,""]
[{"$f":"evidence!A127","v":0},{"$f":"IF(ISTEXT(evidence!B127),evidence!B127,\"\")","v":""},{"$f":"evidence!C127","v":0},{"$f":"evidence!D127","v":0},1918,{"$f":"evidence!E127","v":0},{"$f":"evidence!L127","v":0},{"$f":"evidence!M127","v":0},{"$f":"evidence!N127","v":0},{"$f":"evidence!O127","v":0},{"$f":"evidence!P127","v":0},0,0,0,{"$f":"evidence!Q127","v":"00:00:00"},1900,2016,0,{"$f":"evidence!S127","v":0},"",null,{"$f":"evidence!F127","v":0},{"$f":"evidence!K127","v":0},null,null,null,0,0,0,0,0,0,0,0,0,0,0,0,0,0,0,0,0,0,0,0,0,null,null,null,null,null,0,0,0,0,0,"RODNE_CISLO",0,0,null,null,null,0,0,0,0,"","",0,0,0,0,0,0,null,null,null,null,null,null,null,null,null,null,null,null,null,null,null,null,null,null,null,null,null,null,null,null,null,null,null,null,null,"","","",null,null,"RODNE_CISLO","","",null,null,null,null,null,null,"","",null,null,"",null,"",null,null,null,""]
[{"$f":"evidence!A128","v":0},{"$f":"IF(ISTEXT(evidence!B128),evidence!B128,\"\")","v":""},{"$f":"evidence!C128","v":0},{"$f":"evidence!D128","v":0},1918,{"$f":"evidence!E128","v":0},{"$f":"evidence!L128","v":0},{"$f":"evidence!M128","v":0},{"$f":"evidence!N128","v":0},{"$f":"evidence!O128","v":0},{"$f":"evidence!P128","v":0},0,0,0,{"$f":"evidence!Q128","v":"00:00:00"},1900,2016,0,{"$f":"evidence!S128","v":0},"",null,{"$f":"evidence!F128","v":0},{"$f":"evidence!K128","v":0},null,null,null,0,0,0,0,0,0,0,0,0,0,0,0,0,0,0,0,0,0,0,0,0,null,null,null,null,null,0,0,0,0,0,"RODNE_CISLO",0,0,null,null,null,0,0,0,0,"","",0,0,0,0,0,0,null,null,null,null,null,null,null,null,null,null,null,null,null,null,null,null,null,null,null,null,null,null,null,null,null,null,null,null,null,"","","",null,null,"RODNE_CISLO","","",null,null,null,null,null,null,"","",null,null,"",null,"",null,null,null,""]
[{"$f":"evidence!A129","v":0},{"$f":"IF(ISTEXT(evidence!B129),evidence!B129,\"\")","v":""},{"$f":"evidence!C129","v":0},{"$f":"evidence!D129","v":0},1918,{"$f":"evidence!E129","v":0},{"$f":"evidence!L129","v":0},{"$f":"evidence!M129","v":0},{"$f":"evidence!N129","v":0},{"$f":"evidence!O129","v":0},{"$f":"evidence!P129","v":0},0,0,0,{"$f":"evidence!Q129","v":"00:00:00"},1900,2016,0,{"$f":"evidence!S129","v":0},"",null,{"$f":"evidence!F129","v":0},{"$f":"evidence!K129","v":0},null,null,null,0,0,0,0,0,0,0,0,0,0,0,0,0,0,0,0,0,0,0,0,0,null,null,null,null,null,0,0,0,0,0,"RODNE_CISLO",0,0,null,null,null,0,0,0,0,"","",0,0,0,0,0,0,null,null,null,null,null,null,null,null,null,null,null,null,null,null,null,null,null,null,null,null,null,null,null,null,null,null,null,null,null,"","","",null,null,"RODNE_CISLO","","",null,null,null,null,null,null,"","",null,null,"",null,"",null,null,null,""]
[{"$f":"evidence!A130","v":0},{"$f":"IF(ISTEXT(evidence!B130),evidence!B130,\"\")","v":""},{"$f":"evidence!C130","v":0},{"$f":"evidence!D130","v":0},1918,{"$f":"evidence!E130","v":0},{"$f":"evidence!L130","v":0},{"$f":"evidence!M130","v":0},{"$f":"evidence!N130","v":0},{"$f":"evidence!O130","v":0},{"$f":"evidence!P130","v":0},0,0,0,{"$f":"evidence!Q130","v":"00:00:00"},1900,2016,0,{"$f":"evidence!S130","v":0},"",null,{"$f":"evidence!F130","v":0},{"$f":"evidence!K130","v":0},null,null,null,0,0,0,0,0,0,0,0,0,0,0,0,0,0,0,0,0,0,0,0,0,null,null,null,null,null,0,0,0,0,0,"RODNE_CISLO",0,0,null,null,null,0,0,0,0,"","",0,0,0,0,{"$f":"IF((AN132>0),T132,0)","v":0},{"$f":"IF((AN132>0),AU132,0)","v":0},null,null,null,null,null,null,null,null,null,null,null,null,null,null,null,null,null,null,null,null,null,null,null,null,null,null,null,null,null,"","","",null,null,"RODNE_CISLO","","",null,null,null,null,null,null,"","",null,null,"",null,"",null,null,null,""]
[{"$f":"evidence!A131","v":0},{"$f":"IF(ISTEXT(evidence!B131),evidence!B131,\"\")","v":""},{"$f":"evidence!C131","v":0},{"$f":"evidence!D131","v":0},{"$f":"YEAR(D133)+$E$2","v":1918},{"$f":"evidence!E131","v":0},{"$f":"evidence!L131","v":0},{"$f":"evidence!M131","v":0},{"$f":"evidence!N131","v":0},{"$f":"evidence!O131","v":0},{"$f":"evidence!P131","v":0},{"$f":"IF((I133=\"ano\"),1,IF(OR(J133=\"ano\"),1,0))","v":0},{"$f":"IF((K133=\"ano\"),1,0)","v":0},{"$f":"IF((T133=\"ANO\"),SUM(L133:M133),0)","v":0},{"$f":"evidence!Q131","v":"00:00:00"},{"$f":"YEAR(O133)","v":1900},{"$f":"MAX(E133,P133,$Q$2)","v":2016},{"$f":"IF(ISTEXT(A133),1,0)","v":0},{"$f":"evidence!S131","v":0},{"$f":"IF(LEN(F133)<9,\"\",\"ANO\")","v":""},null,{"$f":"evidence!F131","v":0},{"$f":"evidence!K131","v":0},null,null,null,{"$f":"IF((T133=\"ANO\"),A133,0)","v":0},{"$f":"IF((T133=\"ANO\"),B133,0)","v":0},{"$f":"IF((T133=\"ANO\"),C133,0)","v":0},{"$f":"IF((T133=\"ANO\"),D133,0)","v":0},{"$f":"IF((T133=\"ANO\"),E133,0)","v":0},{"$f":"IF((T133=\"ANO\"),F133,0)","v":0},{"$f":"IF((T133=\"ANO\"),G133,0)","v":0},{"$f":"IF((T133=\"ANO\"),H133,0)","v":0},{"$f":"IF((T133=\"ANO\"),I133,0)","v":0},{"$f":"IF((T133=\"ANO\"),J133,0)","v":0},{"$f":"IF((T133=\"ANO\"),K133,0)","v":0},{"$f":"IF((T133=\"ANO\"),L133,0)","v":0},{"$f":"IF((T133=\"ANO\"),M133,0)","v":0},{"$f":"IF((T133=\"ANO\"),N133,0)","v":0},{"$f":"IF((T133=\"ANO\"),O133,0)","v":0},{"$f":"IF((T133=\"ANO\"),P133,0)","v":0},{"$f":"IF((T133=\"ANO\"),Q133,0)","v":0},{"$f":"IF((T133=\"ANO\"),R133,0)","v":0},{"$f":"IF((T133=\"ANO\"),S133,0)","v":0},{"$f":"IF((T133=\"ANO\"),V133,0)","v":0},{"$f":"IF((T133=\"ANO\"),W133,0)","v":0},null,null,null,null,null,{"$f":"IF((AN133>0),A133,0)","v":0},{"$f":"IF((AN133>0),B133,0)","v":0},{"$f":"IF((AN133>0),C133,0)","v":0},{"$f":"IF((AN133>0),D133,0)","v":0},{"$f":"IF((AN133>0),E133,0)","v":0},{"$f":"IF((AN133>0),F133,\"RODNE_CISLO\")","v":"RODNE_CISLO"},{"$f":"IF((AN133>0),G133,0)","v":0},{"$f":"IF((AN133>0),H133,0)","v":0},null,null,null,{"$f":"IF((AL133>0),L133,0)","v":0},{"$f":"IF((AM133>0),M133,0)","v":0},{"$f":"IF((AN133>0),N133,0)","v":0},{"$f":"IF((AN133>0),O133,0)","v":0},{"$f":"IF((AL133>0),P133,\"\")","v":""},{"$f":"IF((AM133>0),Q133,\"\")","v":""},{"$f":"IF((AN133>0),R133,0)","v":0},{"$f":"IF((AN133>0),S133,0)","v":0},{"$f":"IF((AN133>0),AT133,0)","v":0},{"$f":"IF((AN133>0),AU133,0)","v":0},0,0,null,null,null,null,null,null,null,null,null,null,null,null,null,null,null,null,null,null,null,null,null,null,null,null,null,null,null,null,null,{"$f":"IF(ISTEXT(CA133),CG133,\"\")","v":""},{"$f":"IF(ISTEXT(CA133),CA133,\"\")","v":""},{"$f":"IF(ISTEXT(CA133),CC133,\"\")","v":""},null,null,{"$f":"IF(ISTEXT(CA133),CF133,\"RODNE_CISLO\")","v":"RODNE_CISLO"},{"$f":"IF(ISTEXT(CA133),\"CZE\",\"\")","v":""},{"$f":"IF(ISTEXT(CA133),CD133,\"\")","v":""},null,null,null,null,null,null,{"$f":"IF(ISTEXT(CA133),CL133,\"\")","v":""},{"$f":"IF(ISTEXT(CA133),CO133,\"\")","v":""},null,null,{"$f":"IF(ISTEXT(CA133),$DY$2,\"\")","v":""},null,{"$f":"IF(ISTEXT(CA133),CM133,\"\")","v":""},null,null,null,{"$f":"IF(ISTEXT(CA133),$DY$2,\"\")","v":""}]
[{"$f":"evidence!A132","v":0},{"$f":"IF(ISTEXT(evidence!B132),evidence!B132,\"\")","v":""},{"$f":"evidence!C132","v":0},{"$f":"evidence!D132","v":0},1918,{"$f":"evidence!E132","v":0},{"$f":"evidence!L132","v":0},{"$f":"evidence!M132","v":0},{"$f":"evidence!N132","v":0},{"$f":"evidence!O132","v":0},{"$f":"evidence!P132","v":0},0,0,0,{"$f":"evidence!Q132","v":"00:00:00"},1900,2016,0,{"$f":"evidence!S132","v":0},"",null,{"$f":"evidence!F132","v":0},{"$f":"evidence!K132","v":0},null,null,null,0,0,0,0,0,0,0,0,0,0,0,0,0,0,0,0,0,0,0,0,0,null,null,null,null,null,0,0,0,0,0,"RODNE_CISLO",0,0,null,null,null,0,0,0,0,"","",0,0,0,0,0,0,null,null,null,null,null,null,null,null,null,null,null,null,null,null,null,null,null,null,null,null,null,null,null,null,null,null,null,null,null,"","","",null,null,"RODNE_CISLO","","",null,null,null,null,null,null,"","",null,null,"",null,"",null,null,null,""]
[{"$f":"evidence!A133","v":0},{"$f":"IF(ISTEXT(evidence!B133),evidence!B133,\"\")","v":""},{"$f":"evidence!C133","v":0},{"$f":"evidence!D133","v":0},1918,{"$f":"evidence!E133","v":0},{"$f":"evidence!L133","v":0},{"$f":"evidence!M133","v":0},{"$f":"evidence!N133","v":0},{"$f":"evidence!O133","v":0},{"$f":"evidence!P133","v":0},0,0,0,{"$f":"evidence!Q133","v":"00:00:00"},1900,2016,0,{"$f":"evidence!S133","v":0},"",null,{"$f":"evidence!F133","v":0},{"$f":"evidence!K133","v":0},null,null,null,0,0,0,0,0,0,0,0,0,0,0,0,0,0,0,0,0,0,0,0,0,null,null,null,null,null,0,0,0,0,0,"RODNE_CISLO",0,0,null,null,null,0,0,0,0,"","",0,0,0,0,0,0,null,null,null,null,null,null,null,null,null,null,null,null,null,null,null,null,null,null,null,null,null,null,null,null,null,null,null,null,null,"","","",null,null,"RODNE_CISLO","","",null,null,null,null,null,null,"","",null,null,"",null,"",null,null,null,""]
[{"$f":"evidence!A134","v":0},{"$f":"IF(ISTEXT(evidence!B134),evidence!B134,\"\")","v":""},{"$f":"evidence!C134","v":0},{"$f":"evidence!D134","v":0},1918,{"$f":"evidence!E134","v":0},{"$f":"evidence!L134","v":0},{"$f":"evidence!M134","v":0},{"$f":"evidence!N134","v":0},{"$f":"evidence!O134","v":0},{"$f":"evidence!P134","v":0},0,0,0,{"$f":"evidence!Q134","v":"00:00:00"},1900,2016,0,{"$f":"evidence!S134","v":0},"",null,{"$f":"evidence!F134","v":0},{"$f":"evidence!K134","v":0},null,null,null,0,0,0,0,0,0,0,0,0,0,0,0,0,0,0,0,0,0,0,0,0,null,null,null,null,null,0,0,0,0,0,"RODNE_CISLO",0,0,null,null,null,0,0,0,0,"","",0,0,0,0,0,0,null,null,null,null,null,null,null,null,null,null,null,null,null,null,null,null,null,null,null,null,null,null,null,null,null,null,null,null,null,"","","",null,null,"RODNE_CISLO","","",null,null,null,null,null,null,"","",null,null,"",null,"",null,null,null,""]
[{"$f":"evidence!A135","v":0},{"$f":"IF(ISTEXT(evidence!B135),evidence!B135,\"\")","v":""},{"$f":"evidence!C135","v":0},{"$f":"evidence!D135","v":0},1918,{"$f":"evidence!E135","v":0},{"$f":"evidence!L135","v":0},{"$f":"evidence!M135","v":0},{"$f":"evidence!N135","v":0},{"$f":"evidence!O135","v":0},{"$f":"evidence!P135","v":0},0,0,0,{"$f":"evidence!Q135","v":"00:00:00"},1900,2016,0,{"$f":"evidence!S135","v":0},"",null,{"$f":"evidence!F135","v":0},{"$f":"evidence!K135","v":0},null,null,null,0,0,0,0,0,0,0,0,0,0,0,0,0,0,0,0,0,0,0,0,0,null,null,null,null,null,0,0,0,0,0,"RODNE_CISLO",0,0,null,null,null,0,0,0,0,"","",0,0,0,0,0,0,null,null,null,null,null,null,null,null,null,null,null,null,null,null,null,null,null,null,null,null,null,null,null,null,null,null,null,null,null,"","","",null,null,"RODNE_CISLO","","",null,null,null,null,null,null,"","",null,null,"",null,"",null,null,null,""]
[{"$f":"evidence!A136","v":0},{"$f":"IF(ISTEXT(evidence!B136),evidence!B136,\"\")","v":""},{"$f":"evidence!C136","v":0},{"$f":"evidence!D136","v":0},1918,{"$f":"evidence!E136","v":0},{"$f":"evidence!L136","v":0},{"$f":"evidence!M136","v":0},{"$f":"evidence!N136","v":0},{"$f":"evidence!O136","v":0},{"$f":"evidence!P136","v":0},0,0,0,{"$f":"evidence!Q136","v":"00:00:00"},1900,2016,0,{"$f":"evidence!S136","v":0},"",null,{"$f":"evidence!F136","v":0},{"$f":"evidence!K136","v":0},null,null,null,0,0,0,0,0,0,0,0,0,0,0,0,0,0,0,0,0,0,0,0,0,null,null,null,null,null,0,0,0,0,0,"RODNE_CISLO",0,0,null,null,null,0,0,0,0,"","",0,0,0,0,0,0,null,null,null,null,null,null,null,null,null,null,null,null,null,null,null,null,null,null,null,null,null,null,null,null,null,null,null,null,null,"","","",null,null,"RODNE_CISLO","","",null,null,null,null,null,null,"","",null,null,"",null,"",null,null,null,""]
[{"$f":"evidence!A137","v":0},{"$f":"IF(ISTEXT(evidence!B137),evidence!B137,\"\")","v":""},{"$f":"evidence!C137","v":0},{"$f":"evidence!D137","v":0},1918,{"$f":"evidence!E137","v":0},{"$f":"evidence!L137","v":0},{"$f":"evidence!M137","v":0},{"$f":"evidence!N137","v":0},{"$f":"evidence!O137","v":0},{"$f":"evidence!P137","v":0},0,0,0,{"$f":"evidence!Q137","v":"00:00:00"},1900,2016,0,{"$f":"evidence!S137","v":0},"",null,{"$f":"evidence!F137","v":0},{"$f":"evidence!K137","v":0},null,null,null,0,0,0,0,0,0,0,0,0,0,0,0,0,0,0,0,0,0,0,0,0,null,null,null,null,null,0,0,0,0,0,"RODNE_CISLO",0,0,null,null,null,0,0,0,0,"","",0,0,0,0,0,0,null,null,null,null,null,null,null,null,null,null,null,null,null,null,null,null,null,null,null,null,null,null,null,null,null,null,null,null,null,"","","",null,null,"RODNE_CISLO","","",null,null,null,null,null,null,"","",null,null,"",null,"",null,null,null,""]
[{"$f":"evidence!A138","v":0},{"$f":"IF(ISTEXT(evidence!B138),evidence!B138,\"\")","v":""},{"$f":"evidence!C138","v":0},{"$f":"evidence!D138","v":0},1918,{"$f":"evidence!E138","v":0},{"$f":"evidence!L138","v":0},{"$f":"evidence!M138","v":0},{"$f":"evidence!N138","v":0},{"$f":"evidence!O138","v":0},{"$f":"evidence!P138","v":0},0,0,0,{"$f":"evidence!Q138","v":"00:00:00"},1900,2016,0,{"$f":"evidence!S138","v":0},"",null,{"$f":"evidence!F138","v":0},{"$f":"evidence!K138","v":0},null,null,null,0,0,0,0,0,0,0,0,0,0,0,0,0,0,0,0,0,0,0,0,0,null,null,null,null,null,0,0,0,0,0,"RODNE_CISLO",0,0,null,null,null,0,0,0,0,"","",0,0,0,0,0,0,null,null,null,null,null,null,null,null,null,null,null,null,null,null,null,null,null,null,null,null,null,null,null,null,null,null,null,null,null,"","","",null,null,"RODNE_CISLO","","",null,null,null,null,null,null,"","",null,null,"",null,"",null,null,null,""]
[{"$f":"evidence!A139","v":0},{"$f":"IF(ISTEXT(evidence!B139),evidence!B139,\"\")","v":""},{"$f":"evidence!C139","v":0},{"$f":"evidence!D139","v":0},1918,{"$f":"evidence!E139","v":0},{"$f":"evidence!L139","v":0},{"$f":"evidence!M139","v":0},{"$f":"evidence!N139","v":0},{"$f":"evidence!O139","v":0},{"$f":"evidence!P139","v":0},0,0,0,{"$f":"evidence!Q139","v":"00:00:00"},1900,2016,0,{"$f":"evidence!S139","v":0},"",null,{"$f":"evidence!F139","v":0},{"$f":"evidence!K139","v":0},null,null,null,0,0,0,0,0,0,0,0,0,0,0,0,0,0,0,0,0,0,0,0,0,null,null,null,null,null,0,0,0,0,0,"RODNE_CISLO",0,0,null,null,null,0,0,0,0,"","",0,0,0,0,0,0,null,null,null,null,null,null,null,null,null,null,null,null,null,null,null,null,null,null,null,null,null,null,null,null,null,null,null,null,null,"","","",null,null,"RODNE_CISLO","","",null,null,null,null,null,null,"","",null,null,"",null,"",null,null,null,""]
[{"$f":"evidence!A140","v":0},{"$f":"IF(ISTEXT(evidence!B140),evidence!B140,\"\")","v":""},{"$f":"evidence!C140","v":0},{"$f":"evidence!D140","v":0},1918,{"$f":"evidence!E140","v":0},{"$f":"evidence!L140","v":0},{"$f":"evidence!M140","v":0},{"$f":"evidence!N140","v":0},{"$f":"evidence!O140","v":0},{"$f":"evidence!P140","v":0},0,0,0,{"$f":"evidence!Q140","v":"00:00:00"},1900,2016,0,{"$f":"evidence!S140","v":0},"",null,{"$f":"evidence!F140","v":0},{"$f":"evidence!K140","v":0},null,null,null,0,0,0,0,0,0,0,0,0,0,0,0,0,0,0,0,0,0,0,0,0,null,null,null,null,null,0,0,0,0,0,"RODNE_CISLO",0,0,null,null,null,0,0,0,0,"","",0,0,0,0,0,0,null,null,null,null,null,null,null,null,null,null,null,null,null,null,null,null,null,null,null,null,null,null,null,null,null,null,null,null,null,"","","",null,null,"RODNE_CISLO","","",null,null,null,null,null,null,"","",null,null,"",null,"",null,null,null,""]
[{"$f":"evidence!A141","v":0},{"$f":"IF(ISTEXT(evidence!B141),evidence!B141,\"\")","v":""},{"$f":"evidence!C141","v":0},{"$f":"evidence!D141","v":0},1918,{"$f":"evidence!E141","v":0},{"$f":"evidence!L141","v":0},{"$f":"evidence!M141","v":0},{"$f":"evidence!N141","v":0},{"$f":"evidence!O141","v":0},{"$f":"evidence!P141","v":0},0,0,0,{"$f":"evidence!Q141","v":"00:00:00"},1900,2016,0,{"$f":"evidence!S141","v":0},"",null,{"$f":"evidence!F141","v":0},{"$f":"evidence!K141","v":0},null,null,null,0,0,0,0,0,0,0,0,0,0,0,0,0,0,0,0,0,0,0,0,0,null,null,null,null,null,0,0,0,0,0,"RODNE_CISLO",0,0,null,null,null,0,0,0,0,"","",0,0,0,0,0,0,null,null,null,null,null,null,null,null,null,null,null,null,null,null,null,null,null,null,null,null,null,null,null,null,null,null,null,null,null,"","","",null,null,"RODNE_CISLO","","",null,null,null,null,null,null,"","",null,null,"",null,"",null,null,null,""]
[{"$f":"evidence!A142","v":0},{"$f":"IF(ISTEXT(evidence!B142),evidence!B142,\"\")","v":""},{"$f":"evidence!C142","v":0},{"$f":"evidence!D142","v":0},1918,{"$f":"evidence!E142","v":0},{"$f":"evidence!L142","v":0},{"$f":"evidence!M142","v":0},{"$f":"evidence!N142","v":0},{"$f":"evidence!O142","v":0},{"$f":"evidence!P142","v":0},0,0,0,{"$f":"evidence!Q142","v":"00:00:00"},1900,2016,0,{"$f":"evidence!S142","v":0},"",null,{"$f":"evidence!F142","v":0},{"$f":"evidence!K142","v":0},null,null,null,0,0,0,0,0,0,0,0,0,0,0,0,0,0,0,0,0,0,0,0,0,null,null,null,null,null,0,0,0,0,0,"RODNE_CISLO",0,0,null,null,null,0,0,0,0,"","",0,0,0,0,0,0,null,null,null,null,null,null,null,null,null,null,null,null,null,null,null,null,null,null,null,null,null,null,null,null,null,null,null,null,null,"","","",null,null,"RODNE_CISLO","","",null,null,null,null,null,null,"","",null,null,"",null,"",null,null,null,""]
[{"$f":"evidence!A143","v":0},{"$f":"IF(ISTEXT(evidence!B143),evidence!B143,\"\")","v":""},{"$f":"evidence!C143","v":0},{"$f":"evidence!D143","v":0},1918,{"$f":"evidence!E143","v":0},{"$f":"evidence!L143","v":0},{"$f":"evidence!M143","v":0},{"$f":"evidence!N143","v":0},{"$f":"evidence!O143","v":0},{"$f":"evidence!P143","v":0},0,0,0,{"$f":"evidence!Q143","v":"00:00:00"},1900,2016,0,{"$f":"evidence!S143","v":0},"",null,{"$f":"evidence!F143","v":0},{"$f":"evidence!K143","v":0},null,null,null,0,0,0,0,0,0,0,0,0,0,0,0,0,0,0,0,0,0,0,0,0,null,null,null,null,null,0,0,0,0,0,"RODNE_CISLO",0,0,null,null,null,0,0,0,0,"","",0,0,0,0,0,0,null,null,null,null,null,null,null,null,null,null,null,null,null,null,null,null,null,null,null,null,null,null,null,null,null,null,null,null,null,"","","",null,null,"RODNE_CISLO","","",null,null,null,null,null,null,"","",null,null,"",null,"",null,null,null,""]
[{"$f":"evidence!A144","v":0},{"$f":"IF(ISTEXT(evidence!B144),evidence!B144,\"\")","v":""},{"$f":"evidence!C144","v":0},{"$f":"evidence!D144","v":0},1918,{"$f":"evidence!E144","v":0},{"$f":"evidence!L144","v":0},{"$f":"evidence!M144","v":0},{"$f":"evidence!N144","v":0},{"$f":"evidence!O144","v":0},{"$f":"evidence!P144","v":0},0,0,0,{"$f":"evidence!Q144","v":"00:00:00"},1900,2016,0,{"$f":"evidence!S144","v":0},"",null,{"$f":"evidence!F144","v":0},{"$f":"evidence!K144","v":0},null,null,null,0,0,0,0,0,0,0,0,0,0,0,0,0,0,0,0,0,0,0,0,0,null,null,null,null,null,0,0,0,0,0,"RODNE_CISLO",0,0,null,null,null,0,0,0,0,"","",0,0,0,0,0,0,null,null,null,null,null,null,null,null,null,null,null,null,null,null,null,null,null,null,null,null,null,null,null,null,null,null,null,null,null,"","","",null,null,"RODNE_CISLO","","",null,null,null,null,null,null,"","",null,null,"",null,"",null,null,null,""]
[{"$f":"evidence!A145","v":0},{"$f":"IF(ISTEXT(evidence!B145),evidence!B145,\"\")","v":""},{"$f":"evidence!C145","v":0},{"$f":"evidence!D145","v":0},1918,{"$f":"evidence!E145","v":0},{"$f":"evidence!L145","v":0},{"$f":"evidence!M145","v":0},{"$f":"evidence!N145","v":0},{"$f":"evidence!O145","v":0},{"$f":"evidence!P145","v":0},0,0,0,{"$f":"evidence!Q145","v":"00:00:00"},1900,2016,0,{"$f":"evidence!S145","v":0},"",null,{"$f":"evidence!F145","v":0},{"$f":"evidence!K145","v":0},null,null,null,0,0,0,0,0,0,0,0,0,0,0,0,0,0,0,0,0,0,0,0,0,null,null,null,null,null,0,0,0,0,0,"RODNE_CISLO",0,0,null,null,null,0,0,0,0,"","",0,0,0,0,0,0,null,null,null,null,null,null,null,null,null,null,null,null,null,null,null,null,null,null,null,null,null,null,null,null,null,null,null,null,null,"","","",null,null,"RODNE_CISLO","","",null,null,null,null,null,null,"","",null,null,"",null,"",null,null,null,""]
[{"$f":"evidence!A146","v":0},{"$f":"IF(ISTEXT(evidence!B146),evidence!B146,\"\")","v":""},{"$f":"evidence!C146","v":0},{"$f":"evidence!D146","v":0},1918,{"$f":"evidence!E146","v":0},{"$f":"evidence!L146","v":0},{"$f":"evidence!M146","v":0},{"$f":"evidence!N146","v":0},{"$f":"evidence!O146","v":0},{"$f":"evidence!P146","v":0},0,0,0,{"$f":"evidence!Q146","v":"00:00:00"},1900,2016,0,{"$f":"evidence!S146","v":0},"",null,{"$f":"evidence!F146","v":0},{"$f":"evidence!K146","v":0},null,null,null,0,0,0,0,0,0,0,0,0,0,0,0,0,0,0,0,0,0,0,0,0,null,null,null,null,null,0,0,0,0,0,"RODNE_CISLO",0,0,null,null,null,0,0,0,0,"","",0,0,0,0,0,0,null,null,null,null,null,null,null,null,null,null,null,null,null,null,null,null,null,null,null,null,null,null,null,null,null,null,null,null,null,"","","",null,null,"RODNE_CISLO","","",null,null,null,null,null,null,"","",null,null,"",null,"",null,null,null,""]
[{"$f":"evidence!A147","v":0},{"$f":"IF(ISTEXT(evidence!B147),evidence!B147,\"\")","v":""},{"$f":"evidence!C147","v":0},{"$f":"evidence!D147","v":0},1918,{"$f":"evidence!E147","v":0},{"$f":"evidence!L147","v":0},{"$f":"evidence!M147","v":0},{"$f":"evidence!N147","v":0},{"$f":"evidence!O147","v":0},{"$f":"evidence!P147","v":0},0,0,0,{"$f":"evidence!Q147","v":"00:00:00"},1900,2016,0,{"$f":"evidence!S147","v":0},"",null,{"$f":"evidence!F147","v":0},{"$f":"evidence!K147","v":0},null,null,null,0,0,0,0,0,0,0,0,0,0,0,0,0,0,0,0,0,0,0,0,0,null,null,null,null,null,0,0,0,0,0,"RODNE_CISLO",0,0,null,null,null,0,0,0,0,"","",0,0,0,0,0,0,null,null,null,null,null,null,null,null,null,null,null,null,null,null,null,null,null,null,null,null,null,null,null,null,null,null,null,null,null,"","","",null,null,"RODNE_CISLO","","",null,null,null,null,null,null,"","",null,null,"",null,"",null,null,null,""]
[{"$f":"evidence!A148","v":0},{"$f":"IF(ISTEXT(evidence!B148),evidence!B148,\"\")","v":""},{"$f":"evidence!C148","v":0},{"$f":"evidence!D148","v":0},1918,{"$f":"evidence!E148","v":0},{"$f":"evidence!L148","v":0},{"$f":"evidence!M148","v":0},{"$f":"evidence!N148","v":0},{"$f":"evidence!O148","v":0},{"$f":"evidence!P148","v":0},0,0,0,{"$f":"evidence!Q148","v":"00:00:00"},1900,2016,0,{"$f":"evidence!S148","v":0},"",null,{"$f":"evidence!F148","v":0},{"$f":"evidence!K148","v":0},null,null,null,0,0,0,0,0,0,0,0,0,0,0,0,0,0,0,0,0,0,0,0,0,null,null,null,null,null,0,0,0,0,0,"RODNE_CISLO",0,0,null,null,null,0,0,0,0,"","",0,0,0,0,0,0,null,null,null,null,null,null,null,null,null,null,null,null,null,null,null,null,null,null,null,null,null,null,null,null,null,null,null,null,null,"","","",null,null,"RODNE_CISLO","","",null,null,null,null,null,null,"","",null,null,"",null,"",null,null,null,""]
[{"$f":"evidence!A149","v":0},{"$f":"IF(ISTEXT(evidence!B149),evidence!B149,\"\")","v":""},{"$f":"evidence!C149","v":0},{"$f":"evidence!D149","v":0},1918,{"$f":"evidence!E149","v":0},{"$f":"evidence!L149","v":0},{"$f":"evidence!M149","v":0},{"$f":"evidence!N149","v":0},{"$f":"evidence!O149","v":0},{"$f":"evidence!P149","v":0},0,0,0,{"$f":"evidence!Q149","v":"00:00:00"},1900,2016,0,{"$f":"evidence!S149","v":0},"",null,{"$f":"evidence!F149","v":0},{"$f":"evidence!K149","v":0},null,null,null,0,0,0,0,0,0,0,0,0,0,0,0,0,0,0,0,0,0,0,0,0,null,null,null,null,null,0,0,0,0,0,"RODNE_CISLO",0,0,null,null,null,0,0,0,0,"","",0,0,0,0,0,0,null,null,null,null,null,null,null,null,null,null,null,null,null,null,null,null,null,null,null,null,null,null,null,null,null,null,null,null,null,"","","",null,null,"RODNE_CISLO","","",null,null,null,null,null,null,"","",null,null,"",null,"",null,null,null,""]
[{"$f":"evidence!A150","v":0},{"$f":"IF(ISTEXT(evidence!B150),evidence!B150,\"\")","v":""},{"$f":"evidence!C150","v":0},{"$f":"evidence!D150","v":0},1918,{"$f":"evidence!E150","v":0},{"$f":"evidence!L150","v":0},{"$f":"evidence!M150","v":0},{"$f":"evidence!N150","v":0},{"$f":"evidence!O150","v":0},{"$f":"evidence!P150","v":0},0,0,0,{"$f":"evidence!Q150","v":"00:00:00"},1900,2016,0,{"$f":"evidence!S150","v":0},"",null,{"$f":"evidence!F150","v":0},{"$f":"evidence!K150","v":0},null,null,null,0,0,0,0,0,0,0,0,0,0,0,0,0,0,0,0,0,0,0,0,0,null,null,null,null,null,0,0,0,0,0,"RODNE_CISLO",0,0,null,null,null,0,0,0,0,"","",0,0,0,0,0,0,null,null,null,null,null,null,null,null,null,null,null,null,null,null,null,null,null,null,null,null,null,null,null,null,null,null,null,null,null,"","","",null,null,"RODNE_CISLO","","",null,null,null,null,null,null,"","",null,null,"",null,"",null,null,null,""]
[{"$f":"evidence!A151","v":0},{"$f":"IF(ISTEXT(evidence!B151),evidence!B151,\"\")","v":""},{"$f":"evidence!C151","v":0},{"$f":"evidence!D151","v":0},1918,{"$f":"evidence!E151","v":0},{"$f":"evidence!L151","v":0},{"$f":"evidence!M151","v":0},{"$f":"evidence!N151","v":0},{"$f":"evidence!O151","v":0},{"$f":"evidence!P151","v":0},0,0,0,{"$f":"evidence!Q151","v":"00:00:00"},1900,2016,0,{"$f":"evidence!S151","v":0},"",null,{"$f":"evidence!F151","v":0},{"$f":"evidence!K151","v":0},null,null,null,0,0,0,0,0,0,0,0,0,0,0,0,0,0,0,0,0,0,0,0,0,null,null,null,null,null,0,0,0,0,0,"RODNE_CISLO",0,0,null,null,null,0,0,0,0,"","",0,0,0,0,0,0,null,null,null,null,null,null,null,null,null,null,null,null,null,null,null,null,null,null,null,null,null,null,null,null,null,null,null,null,null,"","","",null,null,"RODNE_CISLO","","",null,null,null,null,null,null,"","",null,null,"",null,"",null,null,null,""]
[{"$f":"evidence!A152","v":0},{"$f":"IF(ISTEXT(evidence!B152),evidence!B152,\"\")","v":""},{"$f":"evidence!C152","v":0},{"$f":"evidence!D152","v":0},1918,{"$f":"evidence!E152","v":0},{"$f":"evidence!L152","v":0},{"$f":"evidence!M152","v":0},{"$f":"evidence!N152","v":0},{"$f":"evidence!O152","v":0},{"$f":"evidence!P152","v":0},0,0,0,{"$f":"evidence!Q152","v":"00:00:00"},1900,2016,0,{"$f":"evidence!S152","v":0},"",null,{"$f":"evidence!F152","v":0},{"$f":"evidence!K152","v":0},null,null,null,0,0,0,0,0,0,0,0,0,0,0,0,0,0,0,0,0,0,0,0,0,null,null,null,null,null,0,0,0,0,0,"RODNE_CISLO",0,0,null,null,null,0,0,0,0,"","",0,0,0,0,0,0,null,null,null,null,null,null,null,null,null,null,null,null,null,null,null,null,null,null,null,null,null,null,null,null,null,null,null,null,null,"","","",null,null,"RODNE_CISLO","","",null,null,null,null,null,null,"","",null,null,"",null,"",null,null,null,""]
[{"$f":"evidence!A153","v":0},{"$f":"IF(ISTEXT(evidence!B153),evidence!B153,\"\")","v":""},{"$f":"evidence!C153","v":0},{"$f":"evidence!D153","v":0},1918,{"$f":"evidence!E153","v":0},{"$f":"evidence!L153","v":0},{"$f":"evidence!M153","v":0},{"$f":"evidence!N153","v":0},{"$f":"evidence!O153","v":0},{"$f":"evidence!P153","v":0},0,0,0,{"$f":"evidence!Q153","v":"00:00:00"},1900,2016,0,{"$f":"evidence!S153","v":0},"",null,{"$f":"evidence!F153","v":0},{"$f":"evidence!K153","v":0},null,null,null,0,0,0,0,0,0,0,0,0,0,0,0,0,0,0,0,0,0,0,0,0,null,null,null,null,null,0,0,0,0,0,"RODNE_CISLO",0,0,null,null,null,0,0,0,0,"","",0,0,0,0,0,0,null,null,null,null,null,null,null,null,null,null,null,null,null,null,null,null,null,null,null,null,null,null,null,null,null,null,null,null,null,"","","",null,null,"RODNE_CISLO","","",null,null,null,null,null,null,"","",null,null,"",null,"",null,null,null,""]
[{"$f":"evidence!A154","v":0},{"$f":"IF(ISTEXT(evidence!B154),evidence!B154,\"\")","v":""},{"$f":"evidence!C154","v":0},{"$f":"evidence!D154","v":0},1918,{"$f":"evidence!E154","v":0},{"$f":"evidence!L154","v":0},{"$f":"evidence!M154","v":0},{"$f":"evidence!N154","v":0},{"$f":"evidence!O154","v":0},{"$f":"evidence!P154","v":0},0,0,0,{"$f":"evidence!Q154","v":"00:00:00"},1900,2016,0,{"$f":"evidence!S154","v":0},"",null,{"$f":"evidence!F154","v":0},{"$f":"evidence!K154","v":0},null,null,null,0,0,0,0,0,0,0,0,0,0,0,0,0,0,0,0,0,0,0,0,0,null,null,null,null,null,0,0,0,0,0,"RODNE_CISLO",0,0,null,null,null,0,0,0,0,"","",0,0,0,0,0,0,null,null,null,null,null,null,null,null,null,null,null,null,null,null,null,null,null,null,null,null,null,null,null,null,null,null,null,null,null,"","","",null,null,"RODNE_CISLO","","",null,null,null,null,null,null,"","",null,null,"",null,"",null,null,null,""]
[{"$f":"evidence!A155","v":0},{"$f":"IF(ISTEXT(evidence!B155),evidence!B155,\"\")","v":""},{"$f":"evidence!C155","v":0},{"$f":"evidence!D155","v":0},1918,{"$f":"evidence!E155","v":0},{"$f":"evidence!L155","v":0},{"$f":"evidence!M155","v":0},{"$f":"evidence!N155","v":0},{"$f":"evidence!O155","v":0},{"$f":"evidence!P155","v":0},0,0,0,{"$f":"evidence!Q155","v":"00:00:00"},1900,2016,0,{"$f":"evidence!S155","v":0},"",null,{"$f":"evidence!F155","v":0},{"$f":"evidence!K155","v":0},null,null,null,0,0,0,0,0,0,0,0,0,0,0,0,0,0,0,0,0,0,0,0,0,null,null,null,null,null,0,0,0,0,0,"RODNE_CISLO",0,0,null,null,null,0,0,0,0,"","",0,0,0,0,0,0,null,null,null,null,null,null,null,null,null,null,null,null,null,null,null,null,null,null,null,null,null,null,null,null,null,null,null,null,null,"","","",null,null,"RODNE_CISLO","","",null,null,null,null,null,null,"","",null,null,"",null,"",null,null,null,""]
[{"$f":"evidence!A156","v":0},{"$f":"IF(ISTEXT(evidence!B156),evidence!B156,\"\")","v":""},{"$f":"evidence!C156","v":0},{"$f":"evidence!D156","v":0},1918,{"$f":"evidence!E156","v":0},{"$f":"evidence!L156","v":0},{"$f":"evidence!M156","v":0},{"$f":"evidence!N156","v":0},{"$f":"evidence!O156","v":0},{"$f":"evidence!P156","v":0},0,0,0,{"$f":"evidence!Q156","v":"00:00:00"},1900,2016,0,{"$f":"evidence!S156","v":0},"",null,{"$f":"evidence!F156","v":0},{"$f":"evidence!K156","v":0},null,null,null,0,0,0,0,0,0,0,0,0,0,0,0,0,0,0,0,0,0,0,0,0,null,null,null,null,null,0,0,0,0,0,"RODNE_CISLO",0,0,null,null,null,0,0,0,0,"","",0,0,0,0,0,0,null,null,null,null,null,null,null,null,null,null,null,null,null,null,null,null,null,null,null,null,null,null,null,null,null,null,null,null,null,"","","",null,null,"RODNE_CISLO","","",null,null,null,null,null,null,"","",null,null,"",null,"",null,null,null,""]
[{"$f":"evidence!A157","v":0},{"$f":"IF(ISTEXT(evidence!B157),evidence!B157,\"\")","v":""},{"$f":"evidence!C157","v":0},{"$f":"evidence!D157","v":0},1918,{"$f":"evidence!E157","v":0},{"$f":"evidence!L157","v":0},{"$f":"evidence!M157","v":0},{"$f":"evidence!N157","v":0},{"$f":"evidence!O157","v":0},{"$f":"evidence!P157","v":0},0,0,0,{"$f":"evidence!Q157","v":"00:00:00"},1900,2016,0,{"$f":"evidence!S157","v":0},"",null,{"$f":"evidence!F157","v":0},{"$f":"evidence!K157","v":0},null,null,null,0,0,0,0,0,0,0,0,0,0,0,0,0,0,0,0,0,0,0,0,0,null,null,null,null,null,0,0,0,0,0,"RODNE_CISLO",0,0,null,null,null,0,0,0,0,"","",0,0,0,0,0,0,null,null,null,null,null,null,null,null,null,null,null,null,null,null,null,null,null,null,null,null,null,null,null,null,null,null,null,null,null,"","","",null,null,"RODNE_CISLO","","",null,null,null,null,null,null,"","",null,null,"",null,"",null,null,null,""]
[{"$f":"evidence!A158","v":0},{"$f":"IF(ISTEXT(evidence!B158),evidence!B158,\"\")","v":""},{"$f":"evidence!C158","v":0},{"$f":"evidence!D158","v":0},1918,{"$f":"evidence!E158","v":0},{"$f":"evidence!L158","v":0},{"$f":"evidence!M158","v":0},{"$f":"evidence!N158","v":0},{"$f":"evidence!O158","v":0},{"$f":"evidence!P158","v":0},0,0,0,{"$f":"evidence!Q158","v":"00:00:00"},1900,2016,0,{"$f":"evidence!S158","v":0},"",null,{"$f":"evidence!F158","v":0},{"$f":"evidence!K158","v":0},null,null,null,0,0,0,0,0,0,0,0,0,0,0,0,0,0,0,0,0,0,0,0,0,null,null,null,null,null,0,0,0,0,0,"RODNE_CISLO",0,0,null,null,null,0,0,0,0,"","",0,0,0,0,0,0,null,null,null,null,null,null,null,null,null,null,null,null,null,null,null,null,null,null,null,null,null,null,null,null,null,null,null,null,null,"","","",null,null,"RODNE_CISLO","","",null,null,null,null,null,null,"","",null,null,"",null,"",null,null,null,""]
[{"$f":"evidence!A159","v":0},{"$f":"IF(ISTEXT(evidence!B159),evidence!B159,\"\")","v":""},{"$f":"evidence!C159","v":0},{"$f":"evidence!D159","v":0},1918,{"$f":"evidence!E159","v":0},{"$f":"evidence!L159","v":0},{"$f":"evidence!M159","v":0},{"$f":"evidence!N159","v":0},{"$f":"evidence!O159","v":0},{"$f":"evidence!P159","v":0},0,0,0,{"$f":"evidence!Q159","v":"00:00:00"},1900,2016,0,{"$f":"evidence!S159","v":0},"",null,{"$f":"evidence!F159","v":0},{"$f":"evidence!K159","v":0},null,null,null,0,0,0,0,0,0,0,0,0,0,0,0,0,0,0,0,0,0,0,0,0,null,null,null,null,null,0,0,0,0,0,"RODNE_CISLO",0,0,null,null,null,0,0,0,0,"","",0,0,0,0,0,0,null,null,null,null,null,null,null,null,null,null,null,null,null,null,null,null,null,null,null,null,null,null,null,null,null,null,null,null,null,"","","",null,null,"RODNE_CISLO","","",null,null,null,null,null,null,"","",null,null,"",null,"",null,null,null,""]
[{"$f":"evidence!A160","v":0},{"$f":"IF(ISTEXT(evidence!B160),evidence!B160,\"\")","v":""},{"$f":"evidence!C160","v":0},{"$f":"evidence!D160","v":0},1918,{"$f":"evidence!E160","v":0},{"$f":"evidence!L160","v":0},{"$f":"evidence!M160","v":0},{"$f":"evidence!N160","v":0},{"$f":"evidence!O160","v":0},{"$f":"evidence!P160","v":0},0,0,0,{"$f":"evidence!Q160","v":"00:00:00"},1900,2016,0,{"$f":"evidence!S160","v":0},"",null,{"$f":"evidence!F160","v":0},{"$f":"evidence!K160","v":0},null,null,null,0,0,0,0,0,0,0,0,0,0,0,0,0,0,0,0,0,0,0,0,0,null,null,null,null,null,0,0,0,0,0,"RODNE_CISLO",0,0,null,null,null,0,0,0,0,"","",0,0,0,0,0,0,null,null,null,null,null,null,null,null,null,null,null,null,null,null,null,null,null,null,null,null,null,null,null,null,null,null,null,null,null,"","","",null,null,"RODNE_CISLO","","",null,null,null,null,null,null,"","",null,null,"",null,"",null,null,null,""]
[{"$f":"evidence!A161","v":0},{"$f":"IF(ISTEXT(evidence!B161),evidence!B161,\"\")","v":""},{"$f":"evidence!C161","v":0},{"$f":"evidence!D161","v":0},1918,{"$f":"evidence!E161","v":0},{"$f":"evidence!L161","v":0},{"$f":"evidence!M161","v":0},{"$f":"evidence!N161","v":0},{"$f":"evidence!O161","v":0},{"$f":"evidence!P161","v":0},0,0,0,{"$f":"evidence!Q161","v":"00:00:00"},1900,2016,0,{"$f":"evidence!S161","v":0},"",null,{"$f":"evidence!F161","v":0},{"$f":"evidence!K161","v":0},null,null,null,0,0,0,0,0,0,0,0,0,0,0,0,0,0,0,0,0,0,0,0,0,null,null,null,null,null,0,0,0,0,0,"RODNE_CISLO",0,0,null,null,null,0,0,0,0,"","",0,0,0,0,0,0,null,null,null,null,null,null,null,null,null,null,null,null,null,null,null,null,null,null,null,null,null,null,null,null,null,null,null,null,null,"","","",null,null,"RODNE_CISLO","","",null,null,null,null,null,null,"","",null,null,"",null,"",null,null,null,""]
[{"$f":"evidence!A162","v":0},{"$f":"IF(ISTEXT(evidence!B162),evidence!B162,\"\")","v":""},{"$f":"evidence!C162","v":0},{"$f":"evidence!D162","v":0},1918,{"$f":"evidence!E162","v":0},{"$f":"evidence!L162","v":0},{"$f":"evidence!M162","v":0},{"$f":"evidence!N162","v":0},{"$f":"evidence!O162","v":0},{"$f":"evidence!P162","v":0},0,0,0,{"$f":"evidence!Q162","v":"00:00:00"},1900,2016,0,{"$f":"evidence!S162","v":0},"",null,{"$f":"evidence!F162","v":0},{"$f":"evidence!K162","v":0},null,null,null,0,0,0,0,0,0,0,0,0,0,0,0,0,0,0,0,0,0,0,0,0,null,null,null,null,null,0,0,0,0,0,"RODNE_CISLO",0,0,null,null,null,0,0,0,0,"","",0,0,0,0,0,0,null,null,null,null,null,null,null,null,null,null,null,null,null,null,null,null,null,null,null,null,null,null,null,null,null,null,null,null,null,"","","",null,null,"RODNE_CISLO","","",null,null,null,null,null,null,"","",null,null,"",null,"",null,null,null,""]
[{"$f":"evidence!A163","v":0},{"$f":"IF(ISTEXT(evidence!B163),evidence!B163,\"\")","v":""},{"$f":"evidence!C163","v":0},{"$f":"evidence!D163","v":0},1918,{"$f":"evidence!E163","v":0},{"$f":"evidence!L163","v":0},{"$f":"evidence!M163","v":0},{"$f":"evidence!N163","v":0},{"$f":"evidence!O163","v":0},{"$f":"evidence!P163","v":0},0,0,0,{"$f":"evidence!Q163","v":"00:00:00"},1900,2016,0,{"$f":"evidence!S163","v":0},"",null,{"$f":"evidence!F163","v":0},{"$f":"evidence!K163","v":0},null,null,null,0,0,0,0,0,0,0,0,0,0,0,0,0,0,0,0,0,0,0,0,0,null,null,null,null,null,0,0,0,0,0,"RODNE_CISLO",0,0,null,null,null,0,0,0,0,"","",0,0,0,0,0,0,null,null,null,null,null,null,null,null,null,null,null,null,null,null,null,null,null,null,null,null,null,null,null,null,null,null,null,null,null,"","","",null,null,"RODNE_CISLO","","",null,null,null,null,null,null,"","",null,null,"",null,"",null,null,null,""]
[{"$f":"evidence!A164","v":0},{"$f":"IF(ISTEXT(evidence!B164),evidence!B164,\"\")","v":""},{"$f":"evidence!C164","v":0},{"$f":"evidence!D164","v":0},1918,{"$f":"evidence!E164","v":0},{"$f":"evidence!L164","v":0},{"$f":"evidence!M164","v":0},{"$f":"evidence!N164","v":0},{"$f":"evidence!O164","v":0},{"$f":"evidence!P164","v":0},0,0,0,{"$f":"evidence!Q164","v":"00:00:00"},1900,2016,0,{"$f":"evidence!S164","v":0},"",null,{"$f":"evidence!F164","v":0},{"$f":"evidence!K164","v":0},null,null,null,0,0,0,0,0,0,0,0,0,0,0,0,0,0,0,0,0,0,0,0,0,null,null,null,null,null,0,0,0,0,0,"RODNE_CISLO",0,0,null,null,null,0,0,0,0,"","",0,0,0,0,0,0,null,null,null,null,null,null,null,null,null,null,null,null,null,null,null,null,null,null,null,null,null,null,null,null,null,null,null,null,null,"","","",null,null,"RODNE_CISLO","","",null,null,null,null,null,null,"","",null,null,"",null,"",null,null,null,""]
[{"$f":"evidence!A165","v":0},{"$f":"IF(ISTEXT(evidence!B165),evidence!B165,\"\")","v":""},{"$f":"evidence!C165","v":0},{"$f":"evidence!D165","v":0},1918,{"$f":"evidence!E165","v":0},{"$f":"evidence!L165","v":0},{"$f":"evidence!M165","v":0},{"$f":"evidence!N165","v":0},{"$f":"evidence!O165","v":0},{"$f":"evidence!P165","v":0},0,0,0,{"$f":"evidence!Q165","v":"00:00:00"},1900,2016,0,{"$f":"evidence!S165","v":0},"",null,{"$f":"evidence!F165","v":0},{"$f":"evidence!K165","v":0},null,null,null,0,0,0,0,0,0,0,0,0,0,0,0,0,0,0,0,0,0,0,0,0,null,null,null,null,null,0,0,0,0,0,"RODNE_CISLO",0,0,null,null,null,0,0,0,0,"","",0,0,0,0,0,0,null,null,null,null,null,null,null,null,null,null,null,null,null,null,null,null,null,null,null,null,null,null,null,null,null,null,null,null,null,"","","",null,null,"RODNE_CISLO","","",null,null,null,null,null,null,"","",null,null,"",null,"",null,null,null,""]
[{"$f":"evidence!A166","v":0},{"$f":"IF(ISTEXT(evidence!B166),evidence!B166,\"\")","v":""},{"$f":"evidence!C166","v":0},{"$f":"evidence!D166","v":0},1918,{"$f":"evidence!E166","v":0},{"$f":"evidence!L166","v":0},{"$f":"evidence!M166","v":0},{"$f":"evidence!N166","v":0},{"$f":"evidence!O166","v":0},{"$f":"evidence!P166","v":0},0,0,0,{"$f":"evidence!Q166","v":"00:00:00"},1900,2016,0,{"$f":"evidence!S166","v":0},"",null,{"$f":"evidence!F166","v":0},{"$f":"evidence!K166","v":0},null,null,null,0,0,0,0,0,0,0,0,0,0,0,0,0,0,0,0,0,0,0,0,0,null,null,null,null,null,0,0,0,0,0,"RODNE_CISLO",0,0,null,null,null,0,0,0,0,"","",0,0,0,0,0,0,null,null,null,null,null,null,null,null,null,null,null,null,null,null,null,null,null,null,null,null,null,null,null,null,null,null,null,null,null,"","","",null,null,"RODNE_CISLO","","",null,null,null,null,null,null,"","",null,null,"",null,"",null,null,null,""]
[{"$f":"evidence!A167","v":0},{"$f":"IF(ISTEXT(evidence!B167),evidence!B167,\"\")","v":""},{"$f":"evidence!C167","v":0},{"$f":"evidence!D167","v":0},1918,{"$f":"evidence!E167","v":0},{"$f":"evidence!L167","v":0},{"$f":"evidence!M167","v":0},{"$f":"evidence!N167","v":0},{"$f":"evidence!O167","v":0},{"$f":"evidence!P167","v":0},0,0,0,{"$f":"evidence!Q167","v":"00:00:00"},1900,2016,0,{"$f":"evidence!S167","v":0},"",null,{"$f":"evidence!F167","v":0},{"$f":"evidence!K167","v":0},null,null,null,0,0,0,0,0,0,0,0,0,0,0,0,0,0,0,0,0,0,0,0,0,null,null,null,null,null,0,0,0,0,0,"RODNE_CISLO",0,0,null,null,null,0,0,0,0,"","",0,0,0,0,0,0,null,null,null,null,null,null,null,null,null,null,null,null,null,null,null,null,null,null,null,null,null,null,null,null,null,null,null,null,null,"","","",null,null,"RODNE_CISLO","","",null,null,null,null,null,null,"","",null,null,"",null,"",null,null,null,""]
[{"$f":"evidence!A168","v":0},{"$f":"IF(ISTEXT(evidence!B168),evidence!B168,\"\")","v":""},{"$f":"evidence!C168","v":0},{"$f":"evidence!D168","v":0},1918,{"$f":"evidence!E168","v":0},{"$f":"evidence!L168","v":0},{"$f":"evidence!M168","v":0},{"$f":"evidence!N168","v":0},{"$f":"evidence!O168","v":0},{"$f":"evidence!P168","v":0},0,0,0,{"$f":"evidence!Q168","v":"00:00:00"},1900,2016,0,{"$f":"evidence!S168","v":0},"",null,{"$f":"evidence!F168","v":0},{"$f":"evidence!K168","v":0},null,null,null,0,0,0,0,0,0,0,0,0,0,0,0,0,0,0,0,0,0,0,0,0,null,null,null,null,null,0,0,0,0,0,"RODNE_CISLO",0,0,null,null,null,0,0,0,0,"","",0,0,0,0,0,0,null,null,null,null,null,null,null,null,null,null,null,null,null,null,null,null,null,null,null,null,null,null,null,null,null,null,null,null,null,"","","",null,null,"RODNE_CISLO","","",null,null,null,null,null,null,"","",null,null,"",null,"",null,null,null,""]
[{"$f":"evidence!A169","v":0},{"$f":"IF(ISTEXT(evidence!B169),evidence!B169,\"\")","v":""},{"$f":"evidence!C169","v":0},{"$f":"evidence!D169","v":0},1918,{"$f":"evidence!E169","v":0},{"$f":"evidence!L169","v":0},{"$f":"evidence!M169","v":0},{"$f":"evidence!N169","v":0},{"$f":"evidence!O169","v":0},{"$f":"evidence!P169","v":0},0,0,0,{"$f":"evidence!Q169","v":"00:00:00"},1900,2016,0,{"$f":"evidence!S169","v":0},"",null,{"$f":"evidence!F169","v":0},{"$f":"evidence!K169","v":0},null,null,null,0,0,0,0,0,0,0,0,0,0,0,0,0,0,0,0,0,0,0,0,0,null,null,null,null,null,0,0,0,0,0,"RODNE_CISLO",0,0,null,null,null,0,0,0,0,"","",0,0,0,0,0,0,null,null,null,null,null,null,null,null,null,null,null,null,null,null,null,null,null,null,null,null,null,null,null,null,null,null,null,null,null,"","","",null,null,"RODNE_CISLO","","",null,null,null,null,null,null,"","",null,null,"",null,"",null,null,null,""]
[{"$f":"evidence!A170","v":0},{"$f":"IF(ISTEXT(evidence!B170),evidence!B170,\"\")","v":""},{"$f":"evidence!C170","v":0},{"$f":"evidence!D170","v":0},1918,{"$f":"evidence!E170","v":0},{"$f":"evidence!L170","v":0},{"$f":"evidence!M170","v":0},{"$f":"evidence!N170","v":0},{"$f":"evidence!O170","v":0},{"$f":"evidence!P170","v":0},0,0,0,{"$f":"evidence!Q170","v":"00:00:00"},1900,2016,0,{"$f":"evidence!S170","v":0},"",null,{"$f":"evidence!F170","v":0},{"$f":"evidence!K170","v":0},null,null,null,0,0,0,0,0,0,0,0,0,0,0,0,0,0,0,0,0,0,0,0,0,null,null,null,null,null,0,0,0,0,0,"RODNE_CISLO",0,0,null,null,null,0,0,0,0,"","",0,0,0,0,0,0,null,null,null,null,null,null,null,null,null,null,null,null,null,null,null,null,null,null,null,null,null,null,null,null,null,null,null,null,null,"","","",null,null,"RODNE_CISLO","","",null,null,null,null,null,null,"","",null,null,"",null,"",null,null,null,""]
[{"$f":"evidence!A171","v":0},{"$f":"IF(ISTEXT(evidence!B171),evidence!B171,\"\")","v":""},{"$f":"evidence!C171","v":0},{"$f":"evidence!D171","v":0},1918,{"$f":"evidence!E171","v":0},{"$f":"evidence!L171","v":0},{"$f":"evidence!M171","v":0},{"$f":"evidence!N171","v":0},{"$f":"evidence!O171","v":0},{"$f":"evidence!P171","v":0},0,0,0,{"$f":"evidence!Q171","v":"00:00:00"},1900,2016,0,{"$f":"evidence!S171","v":0},"",null,{"$f":"evidence!F171","v":0},{"$f":"evidence!K171","v":0},null,null,null,0,0,0,0,0,0,0,0,0,0,0,0,0,0,0,0,0,0,0,0,0,null,null,null,null,null,0,0,0,0,0,"RODNE_CISLO",0,0,null,null,null,0,0,0,0,"","",0,0,0,0,0,0,null,null,null,null,null,null,null,null,null,null,null,null,null,null,null,null,null,null,null,null,null,null,null,null,null,null,null,null,null,"","","",null,null,"RODNE_CISLO","","",null,null,null,null,null,null,"","",null,null,"",null,"",null,null,null,""]
[{"$f":"evidence!A172","v":0},{"$f":"IF(ISTEXT(evidence!B172),evidence!B172,\"\")","v":""},{"$f":"evidence!C172","v":0},{"$f":"evidence!D172","v":0},1918,{"$f":"evidence!E172","v":0},{"$f":"evidence!L172","v":0},{"$f":"evidence!M172","v":0},{"$f":"evidence!N172","v":0},{"$f":"evidence!O172","v":0},{"$f":"evidence!P172","v":0},0,0,0,{"$f":"evidence!Q172","v":"00:00:00"},1900,2016,0,{"$f":"evidence!S172","v":0},"",null,{"$f":"evidence!F172","v":0},{"$f":"evidence!K172","v":0},null,null,null,0,0,0,0,0,0,0,0,0,0,0,0,0,0,0,0,0,0,0,0,0,null,null,null,null,null,0,0,0,0,0,"RODNE_CISLO",0,0,null,null,null,0,0,0,0,"","",0,0,0,0,0,0,null,null,null,null,null,null,null,null,null,null,null,null,null,null,null,null,null,null,null,null,null,null,null,null,null,null,null,null,null,"","","",null,null,"RODNE_CISLO","","",null,null,null,null,null,null,"","",null,null,"",null,"",null,null,null,""]
[{"$f":"evidence!A173","v":0},{"$f":"IF(ISTEXT(evidence!B173),evidence!B173,\"\")","v":""},{"$f":"evidence!C173","v":0},{"$f":"evidence!D173","v":0},1918,{"$f":"evidence!E173","v":0},{"$f":"evidence!L173","v":0},{"$f":"evidence!M173","v":0},{"$f":"evidence!N173","v":0},{"$f":"evidence!O173","v":0},{"$f":"evidence!P173","v":0},0,0,0,{"$f":"evidence!Q173","v":"00:00:00"},1900,2016,0,{"$f":"evidence!S173","v":0},"",null,{"$f":"evidence!F173","v":0},{"$f":"evidence!K173","v":0},null,null,null,0,0,0,0,0,0,0,0,0,0,0,0,0,0,0,0,0,0,0,0,0,null,null,null,null,null,0,0,0,0,0,"RODNE_CISLO",0,0,null,null,null,0,0,0,0,"","",0,0,0,0,0,0,null,null,null,null,null,null,null,null,null,null,null,null,null,null,null,null,null,null,null,null,null,null,null,null,null,null,null,null,null,"","","",null,null,"RODNE_CISLO","","",null,null,null,null,null,null,"","",null,null,"",null,"",null,null,null,""]
[{"$f":"evidence!A174","v":0},{"$f":"IF(ISTEXT(evidence!B174),evidence!B174,\"\")","v":""},{"$f":"evidence!C174","v":0},{"$f":"evidence!D174","v":0},1918,{"$f":"evidence!E174","v":0},{"$f":"evidence!L174","v":0},{"$f":"evidence!M174","v":0},{"$f":"evidence!N174","v":0},{"$f":"evidence!O174","v":0},{"$f":"evidence!P174","v":0},0,0,0,{"$f":"evidence!Q174","v":"00:00:00"},1900,2016,0,{"$f":"evidence!S174","v":0},"",null,{"$f":"evidence!F174","v":0},{"$f":"evidence!K174","v":0},null,null,null,0,0,0,0,0,0,0,0,0,0,0,0,0,0,0,0,0,0,0,0,0,null,null,null,null,null,0,0,0,0,0,"RODNE_CISLO",0,0,null,null,null,0,0,0,0,"","",0,0,0,0,0,0,null,null,null,null,null,null,null,null,null,null,null,null,null,null,null,null,null,null,null,null,null,null,null,null,null,null,null,null,null,"","","",null,null,"RODNE_CISLO","","",null,null,null,null,null,null,"","",null,null,"",null,"",null,null,null,""]
[{"$f":"evidence!A175","v":0},{"$f":"IF(ISTEXT(evidence!B175),evidence!B175,\"\")","v":""},{"$f":"evidence!C175","v":0},{"$f":"evidence!D175","v":0},1918,{"$f":"evidence!E175","v":0},{"$f":"evidence!L175","v":0},{"$f":"evidence!M175","v":0},{"$f":"evidence!N175","v":0},{"$f":"evidence!O175","v":0},{"$f":"evidence!P175","v":0},0,0,0,{"$f":"evidence!Q175","v":"00:00:00"},1900,2016,0,{"$f":"evidence!S175","v":0},"",null,{"$f":"evidence!F175","v":0},{"$f":"evidence!K175","v":0},null,null,null,0,0,0,0,0,0,0,0,0,0,0,0,0,0,0,0,0,0,0,0,0,null,null,null,null,null,0,0,0,0,0,"RODNE_CISLO",0,0,null,null,null,0,0,0,0,"","",0,0,0,0,0,0,null,null,null,null,null,null,null,null,null,null,null,null,null,null,null,null,null,null,null,null,null,null,null,null,null,null,null,null,null,"","","",null,null,"RODNE_CISLO","","",null,null,null,null,null,null,"","",null,null,"",null,"",null,null,null,""]
[{"$f":"evidence!A176","v":0},{"$f":"IF(ISTEXT(evidence!B176),evidence!B176,\"\")","v":""},{"$f":"evidence!C176","v":0},{"$f":"evidence!D176","v":0},1918,{"$f":"evidence!E176","v":0},{"$f":"evidence!L176","v":0},{"$f":"evidence!M176","v":0},{"$f":"evidence!N176","v":0},{"$f":"evidence!O176","v":0},{"$f":"evidence!P176","v":0},0,0,0,{"$f":"evidence!Q176","v":"00:00:00"},1900,2016,0,{"$f":"evidence!S176","v":0},"",null,{"$f":"evidence!F176","v":0},{"$f":"evidence!K176","v":0},null,null,null,0,0,0,0,0,0,0,0,0,0,0,0,0,0,0,0,0,0,0,0,0,null,null,null,null,null,0,0,0,0,0,"RODNE_CISLO",0,0,null,null,null,0,0,0,0,"","",0,0,0,0,0,0,null,null,null,null,null,null,null,null,null,null,null,null,null,null,null,null,null,null,null,null,null,null,null,null,null,null,null,null,null,"","","",null,null,"RODNE_CISLO","","",null,null,null,null,null,null,"","",null,null,"",null,"",null,null,null,""]
[{"$f":"evidence!A177","v":0},{"$f":"IF(ISTEXT(evidence!B177),evidence!B177,\"\")","v":""},{"$f":"evidence!C177","v":0},{"$f":"evidence!D177","v":0},1918,{"$f":"evidence!E177","v":0},{"$f":"evidence!L177","v":0},{"$f":"evidence!M177","v":0},{"$f":"evidence!N177","v":0},{"$f":"evidence!O177","v":0},{"$f":"evidence!P177","v":0},0,0,0,{"$f":"evidence!Q177","v":"00:00:00"},1900,2016,0,{"$f":"evidence!S177","v":0},"",null,{"$f":"evidence!F177","v":0},{"$f":"evidence!K177","v":0},null,null,null,0,0,0,0,0,0,0,0,0,0,0,0,0,0,0,0,0,0,0,0,0,null,null,null,null,null,0,0,0,0,0,"RODNE_CISLO",0,0,null,null,null,0,0,0,0,"","",0,0,0,0,0,0,null,null,null,null,null,null,null,null,null,null,null,null,null,null,null,null,null,null,null,null,null,null,null,null,null,null,null,null,null,"","","",null,null,"RODNE_CISLO","","",null,null,null,null,null,null,"","",null,null,"",null,"",null,null,null,""]
[{"$f":"evidence!A178","v":0},{"$f":"IF(ISTEXT(evidence!B178),evidence!B178,\"\")","v":""},{"$f":"evidence!C178","v":0},{"$f":"evidence!D178","v":0},1918,{"$f":"evidence!E178","v":0},{"$f":"evidence!L178","v":0},{"$f":"evidence!M178","v":0},{"$f":"evidence!N178","v":0},{"$f":"evidence!O178","v":0},{"$f":"evidence!P178","v":0},0,0,0,{"$f":"evidence!Q178","v":"00:00:00"},1900,2016,0,{"$f":"evidence!S178","v":0},"",null,{"$f":"evidence!F178","v":0},{"$f":"evidence!K178","v":0},null,null,null,0,0,0,0,0,0,0,0,0,0,0,0,0,0,0,0,0,0,0,0,0,null,null,null,null,null,0,0,0,0,0,"RODNE_CISLO",0,0,null,null,null,0,0,0,0,"","",0,0,0,0,0,0,null,null,null,null,null,null,null,null,null,null,null,null,null,null,null,null,null,null,null,null,null,null,null,null,null,null,null,null,null,"","","",null,null,"RODNE_CISLO","","",null,null,null,null,null,null,"","",null,null,"",null,"",null,null,null,""]
[{"$f":"evidence!A179","v":0},{"$f":"IF(ISTEXT(evidence!B179),evidence!B179,\"\")","v":""},{"$f":"evidence!C179","v":0},{"$f":"evidence!D179","v":0},1918,{"$f":"evidence!E179","v":0},{"$f":"evidence!L179","v":0},{"$f":"evidence!M179","v":0},{"$f":"evidence!N179","v":0},{"$f":"evidence!O179","v":0},{"$f":"evidence!P179","v":0},0,0,0,{"$f":"evidence!Q179","v":"00:00:00"},1900,2016,0,{"$f":"evidence!S179","v":0},"",null,{"$f":"evidence!F179","v":0},{"$f":"evidence!K179","v":0},null,null,null,0,0,0,0,0,0,0,0,0,0,0,0,0,0,0,0,0,0,0,0,0,null,null,null,null,null,0,0,0,0,0,"RODNE_CISLO",0,0,null,null,null,0,0,0,0,"","",0,0,0,0,0,0,null,null,null,null,null,null,null,null,null,null,null,null,null,null,null,null,null,null,null,null,null,null,null,null,null,null,null,null,null,"","","",null,null,"RODNE_CISLO","","",null,null,null,null,null,null,"","",null,null,"",null,"",null,null,null,""]
[{"$f":"evidence!A180","v":0},{"$f":"IF(ISTEXT(evidence!B180),evidence!B180,\"\")","v":""},{"$f":"evidence!C180","v":0},{"$f":"evidence!D180","v":0},1918,{"$f":"evidence!E180","v":0},{"$f":"evidence!L180","v":0},{"$f":"evidence!M180","v":0},{"$f":"evidence!N180","v":0},{"$f":"evidence!O180","v":0},{"$f":"evidence!P180","v":0},0,0,0,{"$f":"evidence!Q180","v":"00:00:00"},1900,2016,0,{"$f":"evidence!S180","v":0},"",null,{"$f":"evidence!F180","v":0},{"$f":"evidence!K180","v":0},null,null,null,0,0,0,0,0,0,0,0,0,0,0,0,0,0,0,0,0,0,0,0,0,null,null,null,null,null,0,0,0,0,0,"RODNE_CISLO",0,0,null,null,null,0,0,0,0,"","",0,0,0,0,0,0,null,null,null,null,null,null,null,null,null,null,null,null,null,null,null,null,null,null,null,null,null,null,null,null,null,null,null,null,null,"","","",null,null,"RODNE_CISLO","","",null,null,null,null,null,null,"","",null,null,"",null,"",null,null,null,""]
[{"$f":"evidence!A181","v":0},{"$f":"IF(ISTEXT(evidence!B181),evidence!B181,\"\")","v":""},{"$f":"evidence!C181","v":0},{"$f":"evidence!D181","v":0},1918,{"$f":"evidence!E181","v":0},{"$f":"evidence!L181","v":0},{"$f":"evidence!M181","v":0},{"$f":"evidence!N181","v":0},{"$f":"evidence!O181","v":0},{"$f":"evidence!P181","v":0},0,0,0,{"$f":"evidence!Q181","v":"00:00:00"},1900,2016,0,{"$f":"evidence!S181","v":0},"",null,{"$f":"evidence!F181","v":0},{"$f":"evidence!K181","v":0},null,null,null,0,0,0,0,0,0,0,0,0,0,0,0,0,0,0,0,0,0,0,0,0,null,null,null,null,null,0,0,0,0,0,"RODNE_CISLO",0,0,null,null,null,0,0,0,0,"","",0,0,0,0,0,0,null,null,null,null,null,null,null,null,null,null,null,null,null,null,null,null,null,null,null,null,null,null,null,null,null,null,null,null,null,"","","",null,null,"RODNE_CISLO","","",null,null,null,null,null,null,"","",null,null,"",null,"",null,null,null,""]
[{"$f":"evidence!A182","v":0},{"$f":"IF(ISTEXT(evidence!B182),evidence!B182,\"\")","v":""},{"$f":"evidence!C182","v":0},{"$f":"evidence!D182","v":0},1918,{"$f":"evidence!E182","v":0},{"$f":"evidence!L182","v":0},{"$f":"evidence!M182","v":0},{"$f":"evidence!N182","v":0},{"$f":"evidence!O182","v":0},{"$f":"evidence!P182","v":0},0,0,0,{"$f":"evidence!Q182","v":"00:00:00"},1900,2016,0,{"$f":"evidence!S182","v":0},"",null,{"$f":"evidence!F182","v":0},{"$f":"evidence!K182","v":0},null,null,null,0,0,0,0,0,0,0,0,0,0,0,0,0,0,0,0,0,0,0,0,0,null,null,null,null,null,0,0,0,0,0,"RODNE_CISLO",0,0,null,null,null,0,0,0,0,"","",0,0,0,0,0,0,null,null,null,null,null,null,null,null,null,null,null,null,null,null,null,null,null,null,null,null,null,null,null,null,null,null,null,null,null,"","","",null,null,"RODNE_CISLO","","",null,null,null,null,null,null,"","",null,null,"",null,"",null,null,null,""]
[{"$f":"evidence!A183","v":0},{"$f":"IF(ISTEXT(evidence!B183),evidence!B183,\"\")","v":""},{"$f":"evidence!C183","v":0},{"$f":"evidence!D183","v":0},1918,{"$f":"evidence!E183","v":0},{"$f":"evidence!L183","v":0},{"$f":"evidence!M183","v":0},{"$f":"evidence!N183","v":0},{"$f":"evidence!O183","v":0},{"$f":"evidence!P183","v":0},0,0,0,{"$f":"evidence!Q183","v":"00:00:00"},1900,2016,0,{"$f":"evidence!S183","v":0},"",null,{"$f":"evidence!F183","v":0},{"$f":"evidence!K183","v":0},null,null,null,0,0,0,0,0,0,0,0,0,0,0,0,0,0,0,0,0,0,0,0,0,null,null,null,null,null,0,0,0,0,0,"RODNE_CISLO",0,0,null,null,null,0,0,0,0,"","",0,0,0,0,0,0,null,null,null,null,null,null,null,null,null,null,null,null,null,null,null,null,null,null,null,null,null,null,null,null,null,null,null,null,null,"","","",null,null,"RODNE_CISLO","","",null,null,null,null,null,null,"","",null,null,"",null,"",null,null,null,""]
[{"$f":"evidence!A184","v":0},{"$f":"IF(ISTEXT(evidence!B184),evidence!B184,\"\")","v":""},{"$f":"evidence!C184","v":0},{"$f":"evidence!D184","v":0},1918,{"$f":"evidence!E184","v":0},{"$f":"evidence!L184","v":0},{"$f":"evidence!M184","v":0},{"$f":"evidence!N184","v":0},{"$f":"evidence!O184","v":0},{"$f":"evidence!P184","v":0},0,0,0,{"$f":"evidence!Q184","v":"00:00:00"},1900,2016,0,{"$f":"evidence!S184","v":0},"",null,{"$f":"evidence!F184","v":0},{"$f":"evidence!K184","v":0},null,null,null,0,0,0,0,0,0,0,0,0,0,0,0,0,0,0,0,0,0,0,0,0,null,null,null,null,null,0,0,0,0,0,"RODNE_CISLO",0,0,null,null,null,0,0,0,0,"","",0,0,0,0,0,0,null,null,null,null,null,null,null,null,null,null,null,null,null,null,null,null,null,null,null,null,null,null,null,null,null,null,null,null,null,"","","",null,null,"RODNE_CISLO","","",null,null,null,null,null,null,"","",null,null,"",null,"",null,null,null,""]
[{"$f":"evidence!A185","v":0},{"$f":"IF(ISTEXT(evidence!B185),evidence!B185,\"\")","v":""},{"$f":"evidence!C185","v":0},{"$f":"evidence!D185","v":0},1918,{"$f":"evidence!E185","v":0},{"$f":"evidence!L185","v":0},{"$f":"evidence!M185","v":0},{"$f":"evidence!N185","v":0},{"$f":"evidence!O185","v":0},{"$f":"evidence!P185","v":0},0,0,0,{"$f":"evidence!Q185","v":"00:00:00"},1900,2016,0,{"$f":"evidence!S185","v":0},"",null,{"$f":"evidence!F185","v":0},{"$f":"evidence!K185","v":0},null,null,null,0,0,0,0,0,0,0,0,0,0,0,0,0,0,0,0,0,0,0,0,0,null,null,null,null,null,0,0,0,0,0,"RODNE_CISLO",0,0,null,null,null,0,0,0,0,"","",0,0,0,0,0,0,null,null,null,null,null,null,null,null,null,null,null,null,null,null,null,null,null,null,null,null,null,null,null,null,null,null,null,null,null,"","","",null,null,"RODNE_CISLO","","",null,null,null,null,null,null,"","",null,null,"",null,"",null,null,null,""]
[{"$f":"evidence!A186","v":0},{"$f":"IF(ISTEXT(evidence!B186),evidence!B186,\"\")","v":""},{"$f":"evidence!C186","v":0},{"$f":"evidence!D186","v":0},1918,{"$f":"evidence!E186","v":0},{"$f":"evidence!L186","v":0},{"$f":"evidence!M186","v":0},{"$f":"evidence!N186","v":0},{"$f":"evidence!O186","v":0},{"$f":"evidence!P186","v":0},0,0,0,{"$f":"evidence!Q186","v":"00:00:00"},1900,2016,0,{"$f":"evidence!S186","v":0},"",null,{"$f":"evidence!F186","v":0},{"$f":"evidence!K186","v":0},null,null,null,0,0,0,0,0,0,0,0,0,0,0,0,0,0,0,0,0,0,0,0,0,null,null,null,null,null,0,0,0,0,0,"RODNE_CISLO",0,0,null,null,null,0,0,0,0,"","",0,0,0,0,0,0,null,null,null,null,null,null,null,null,null,null,null,null,null,null,null,null,null,null,null,null,null,null,null,null,null,null,null,null,null,"","","",null,null,"RODNE_CISLO","","",null,null,null,null,null,null,"","",null,null,"",null,"",null,null,null,""]
[{"$f":"evidence!A187","v":0},{"$f":"IF(ISTEXT(evidence!B187),evidence!B187,\"\")","v":""},{"$f":"evidence!C187","v":0},{"$f":"evidence!D187","v":0},1918,{"$f":"evidence!E187","v":0},{"$f":"evidence!L187","v":0},{"$f":"evidence!M187","v":0},{"$f":"evidence!N187","v":0},{"$f":"evidence!O187","v":0},{"$f":"evidence!P187","v":0},0,0,0,{"$f":"evidence!Q187","v":"00:00:00"},1900,2016,0,{"$f":"evidence!S187","v":0},"",null,{"$f":"evidence!F187","v":0},{"$f":"evidence!K187","v":0},null,null,null,0,0,0,0,0,0,0,0,0,0,0,0,0,0,0,0,0,0,0,0,0,null,null,null,null,null,0,0,0,0,0,"RODNE_CISLO",0,0,null,null,null,0,0,0,0,"","",0,0,0,0,0,0,null,null,null,null,null,null,null,null,null,null,null,null,null,null,null,null,null,null,null,null,null,null,null,null,null,null,null,null,null,"","","",null,null,"RODNE_CISLO","","",null,null,null,null,null,null,"","",null,null,"",null,"",null,null,null,""]
[{"$f":"evidence!A188","v":0},{"$f":"IF(ISTEXT(evidence!B188),evidence!B188,\"\")","v":""},{"$f":"evidence!C188","v":0},{"$f":"evidence!D188","v":0},1918,{"$f":"evidence!E188","v":0},{"$f":"evidence!L188","v":0},{"$f":"evidence!M188","v":0},{"$f":"evidence!N188","v":0},{"$f":"evidence!O188","v":0},{"$f":"evidence!P188","v":0},0,0,0,{"$f":"evidence!Q188","v":"00:00:00"},1900,2016,0,{"$f":"evidence!S188","v":0},"",null,{"$f":"evidence!F188","v":0},{"$f":"evidence!K188","v":0},null,null,null,0,0,0,0,0,0,0,0,0,0,0,0,0,0,0,0,0,0,0,0,0,null,null,null,null,null,0,0,0,0,0,"RODNE_CISLO",0,0,null,null,null,0,0,0,0,"","",0,0,0,0,0,0,null,null,null,null,null,null,null,null,null,null,null,null,null,null,null,null,null,null,null,null,null,null,null,null,null,null,null,null,null,"","","",null,null,"RODNE_CISLO","","",null,null,null,null,null,null,"","",null,null,"",null,"",null,null,null,""]
[{"$f":"evidence!A189","v":0},{"$f":"IF(ISTEXT(evidence!B189),evidence!B189,\"\")","v":""},{"$f":"evidence!C189","v":0},{"$f":"evidence!D189","v":0},1918,{"$f":"evidence!E189","v":0},{"$f":"evidence!L189","v":0},{"$f":"evidence!M189","v":0},{"$f":"evidence!N189","v":0},{"$f":"evidence!O189","v":0},{"$f":"evidence!P189","v":0},0,0,0,{"$f":"evidence!Q189","v":"00:00:00"},1900,2016,0,{"$f":"evidence!S189","v":0},"",null,{"$f":"evidence!F189","v":0},{"$f":"evidence!K189","v":0},null,null,null,0,0,0,0,0,0,0,0,0,0,0,0,0,0,0,0,0,0,0,0,0,null,null,null,null,null,0,0,0,0,0,"RODNE_CISLO",0,0,null,null,null,0,0,0,0,"","",0,0,0,0,0,0,null,null,null,null,null,null,null,null,null,null,null,null,null,null,null,null,null,null,null,null,null,null,null,null,null,null,null,null,null,"","","",null,null,"RODNE_CISLO","","",null,null,null,null,null,null,"","",null,null,"",null,"",null,null,null,""]
[{"$f":"evidence!A190","v":0},{"$f":"IF(ISTEXT(evidence!B190),evidence!B190,\"\")","v":""},{"$f":"evidence!C190","v":0},{"$f":"evidence!D190","v":0},1918,{"$f":"evidence!E190","v":0},{"$f":"evidence!L190","v":0},{"$f":"evidence!M190","v":0},{"$f":"evidence!N190","v":0},{"$f":"evidence!O190","v":0},{"$f":"evidence!P190","v":0},0,0,0,{"$f":"evidence!Q190","v":"00:00:00"},1900,2016,0,{"$f":"evidence!S190","v":0},"",null,{"$f":"evidence!F190","v":0},{"$f":"evidence!K190","v":0},null,null,null,0,0,0,0,0,0,0,0,0,0,0,0,0,0,0,0,0,0,0,0,0,null,null,null,null,null,0,0,0,0,0,"RODNE_CISLO",0,0,null,null,null,0,0,0,0,"","",0,0,0,0,0,0,null,null,null,null,null,null,null,null,null,null,null,null,null,null,null,null,null,null,null,null,null,null,null,null,null,null,null,null,null,"","","",null,null,"RODNE_CISLO","","",null,null,null,null,null,null,"","",null,null,"",null,"",null,null,null,""]
[{"$f":"evidence!A191","v":0},{"$f":"IF(ISTEXT(evidence!B191),evidence!B191,\"\")","v":""},{"$f":"evidence!C191","v":0},{"$f":"evidence!D191","v":0},1918,{"$f":"evidence!E191","v":0},{"$f":"evidence!L191","v":0},{"$f":"evidence!M191","v":0},{"$f":"evidence!N191","v":0},{"$f":"evidence!O191","v":0},{"$f":"evidence!P191","v":0},0,0,0,{"$f":"evidence!Q191","v":"00:00:00"},1900,2016,0,{"$f":"evidence!S191","v":0},"",null,{"$f":"evidence!F191","v":0},{"$f":"evidence!K191","v":0},null,null,null,0,0,0,0,0,0,0,0,0,0,0,0,0,0,0,0,0,0,0,0,0,null,null,null,null,null,0,0,0,0,0,"RODNE_CISLO",0,0,null,null,null,0,0,0,0,"","",0,0,0,0,0,0,null,null,null,null,null,null,null,null,null,null,null,null,null,null,null,null,null,null,null,null,null,null,null,null,null,null,null,null,null,"","","",null,null,"RODNE_CISLO","","",null,null,null,null,null,null,"","",null,null,"",null,"",null,null,null,""]
[{"$f":"evidence!A192","v":0},{"$f":"IF(ISTEXT(evidence!B192),evidence!B192,\"\")","v":""},{"$f":"evidence!C192","v":0},{"$f":"evidence!D192","v":0},1918,{"$f":"evidence!E192","v":0},{"$f":"evidence!L192","v":0},{"$f":"evidence!M192","v":0},{"$f":"evidence!N192","v":0},{"$f":"evidence!O192","v":0},{"$f":"evidence!P192","v":0},0,0,0,{"$f":"evidence!Q192","v":"00:00:00"},1900,2016,0,{"$f":"evidence!S192","v":0},"",null,{"$f":"evidence!F192","v":0},{"$f":"evidence!K192","v":0},null,null,null,0,0,0,0,0,0,0,0,0,0,0,0,0,0,0,0,0,0,0,0,0,null,null,null,null,null,0,0,0,0,0,"RODNE_CISLO",0,0,null,null,null,0,0,0,0,"","",0,0,0,0,0,0,null,null,null,null,null,null,null,null,null,null,null,null,null,null,null,null,null,null,null,null,null,null,null,null,null,null,null,null,null,"","","",null,null,"RODNE_CISLO","","",null,null,null,null,null,null,"","",null,null,"",null,"",null,null,null,""]
[{"$f":"evidence!A193","v":0},{"$f":"IF(ISTEXT(evidence!B193),evidence!B193,\"\")","v":""},{"$f":"evidence!C193","v":0},{"$f":"evidence!D193","v":0},1918,{"$f":"evidence!E193","v":0},{"$f":"evidence!L193","v":0},{"$f":"evidence!M193","v":0},{"$f":"evidence!N193","v":0},{"$f":"evidence!O193","v":0},{"$f":"evidence!P193","v":0},0,0,0,{"$f":"evidence!Q193","v":"00:00:00"},1900,2016,0,{"$f":"evidence!S193","v":0},"",null,{"$f":"evidence!F193","v":0},{"$f":"evidence!K193","v":0},null,null,null,0,0,0,0,0,0,0,0,0,0,0,0,0,0,0,0,0,0,0,0,0,null,null,null,null,null,0,0,0,0,0,"RODNE_CISLO",0,0,null,null,null,0,0,0,0,"","",0,0,0,0,0,0,null,null,null,null,null,null,null,null,null,null,null,null,null,null,null,null,null,null,null,null,null,null,null,null,null,null,null,null,null,"","","",null,null,"RODNE_CISLO","","",null,null,null,null,null,null,"","",null,null,"",null,"",null,null,null,""]
[{"$f":"evidence!A194","v":0},{"$f":"IF(ISTEXT(evidence!B194),evidence!B194,\"\")","v":""},{"$f":"evidence!C194","v":0},{"$f":"evidence!D194","v":0},1918,{"$f":"evidence!E194","v":0},{"$f":"evidence!L194","v":0},{"$f":"evidence!M194","v":0},{"$f":"evidence!N194","v":0},{"$f":"evidence!O194","v":0},{"$f":"evidence!P194","v":0},0,0,0,{"$f":"evidence!Q194","v":"00:00:00"},1900,2016,0,{"$f":"evidence!S194","v":0},"",null,{"$f":"evidence!F194","v":0},{"$f":"evidence!K194","v":0},null,null,null,0,0,0,0,0,0,0,0,0,0,0,0,0,0,0,0,0,0,0,0,0,null,null,null,null,null,0,0,0,0,0,"RODNE_CISLO",0,0,null,null,null,0,0,0,0,"","",0,0,0,0,{"$f":"IF((AN196>0),T196,0)","v":0},{"$f":"IF((AN196>0),AU196,0)","v":0},null,null,null,null,null,null,null,null,null,null,null,null,null,null,null,null,null,null,null,null,null,null,null,null,null,null,null,null,null,"","","",null,null,"RODNE_CISLO","","",null,null,null,null,null,null,"","",null,null,"",null,"",null,null,null,""]
[{"$f":"evidence!A195","v":0},{"$f":"IF(ISTEXT(evidence!B195),evidence!B195,\"\")","v":""},{"$f":"evidence!C195","v":0},{"$f":"evidence!D195","v":0},{"$f":"YEAR(D197)+$E$2","v":1918},{"$f":"evidence!E195","v":0},{"$f":"evidence!L195","v":0},{"$f":"evidence!M195","v":0},{"$f":"evidence!N195","v":0},{"$f":"evidence!O195","v":0},{"$f":"evidence!P195","v":0},{"$f":"IF((I197=\"ano\"),1,IF(OR(J197=\"ano\"),1,0))","v":0},{"$f":"IF((K197=\"ano\"),1,0)","v":0},{"$f":"IF((T197=\"ANO\"),SUM(L197:M197),0)","v":0},{"$f":"evidence!Q195","v":"00:00:00"},{"$f":"YEAR(O197)","v":1900},{"$f":"MAX(E197,P197,$Q$2)","v":2016},{"$f":"IF(ISTEXT(A197),1,0)","v":0},{"$f":"evidence!S195","v":0},{"$f":"IF(LEN(F197)<9,\"\",\"ANO\")","v":""},null,{"$f":"evidence!F195","v":0},{"$f":"evidence!K195","v":0},null,null,null,{"$f":"IF((T197=\"ANO\"),A197,0)","v":0},{"$f":"IF((T197=\"ANO\"),B197,0)","v":0},{"$f":"IF((T197=\"ANO\"),C197,0)","v":0},{"$f":"IF((T197=\"ANO\"),D197,0)","v":0},{"$f":"IF((T197=\"ANO\"),E197,0)","v":0},{"$f":"IF((T197=\"ANO\"),F197,0)","v":0},{"$f":"IF((T197=\"ANO\"),G197,0)","v":0},{"$f":"IF((T197=\"ANO\"),H197,0)","v":0},{"$f":"IF((T197=\"ANO\"),I197,0)","v":0},{"$f":"IF((T197=\"ANO\"),J197,0)","v":0},{"$f":"IF((T197=\"ANO\"),K197,0)","v":0},{"$f":"IF((T197=\"ANO\"),L197,0)","v":0},{"$f":"IF((T197=\"ANO\"),M197,0)","v":0},{"$f":"IF((T197=\"ANO\"),N197,0)","v":0},{"$f":"IF((T197=\"ANO\"),O197,0)","v":0},{"$f":"IF((T197=\"ANO\"),P197,0)","v":0},{"$f":"IF((T197=\"ANO\"),Q197,0)","v":0},{"$f":"IF((T197=\"ANO\"),R197,0)","v":0},{"$f":"IF((T197=\"ANO\"),S197,0)","v":0},{"$f":"IF((T197=\"ANO\"),V197,0)","v":0},{"$f":"IF((T197=\"ANO\"),W197,0)","v":0},null,null,null,null,null,{"$f":"IF((AN197>0),A197,0)","v":0},{"$f":"IF((AN197>0),B197,0)","v":0},{"$f":"IF((AN197>0),C197,0)","v":0},{"$f":"IF((AN197>0),D197,0)","v":0},{"$f":"IF((AN197>0),E197,0)","v":0},{"$f":"IF((AN197>0),F197,\"RODNE_CISLO\")","v":"RODNE_CISLO"},{"$f":"IF((AN197>0),G197,0)","v":0},{"$f":"IF((AN197>0),H197,0)","v":0},null,null,null,{"$f":"IF((AL197>0),L197,0)","v":0},{"$f":"IF((AM197>0),M197,0)","v":0},{"$f":"IF((AN197>0),N197,0)","v":0},{"$f":"IF((AN197>0),O197,0)","v":0},{"$f":"IF((AL197>0),P197,\"\")","v":""},{"$f":"IF((AM197>0),Q197,\"\")","v":""},{"$f":"IF((AN197>0),R197,0)","v":0},{"$f":"IF((AN197>0),S197,0)","v":0},{"$f":"IF((AN197>0),AT197,0)","v":0},{"$f":"IF((AN197>0),AU197,0)","v":0},0,0,null,null,null,null,null,null,null,null,null,null,null,null,null,null,null,null,null,null,null,null,null,null,null,null,null,null,null,null,null,{"$f":"IF(ISTEXT(CA197),CG197,\"\")","v":""},{"$f":"IF(ISTEXT(CA197),CA197,\"\")","v":""},{"$f":"IF(ISTEXT(CA197),CC197,\"\")","v":""},null,null,{"$f":"IF(ISTEXT(CA197),CF197,\"RODNE_CISLO\")","v":"RODNE_CISLO"},{"$f":"IF(ISTEXT(CA197),\"CZE\",\"\")","v":""},{"$f":"IF(ISTEXT(CA197),CD197,\"\")","v":""},null,null,null,null,null,null,{"$f":"IF(ISTEXT(CA197),CL197,\"\")","v":""},{"$f":"IF(ISTEXT(CA197),CO197,\"\")","v":""},null,null,{"$f":"IF(ISTEXT(CA197),$DY$2,\"\")","v":""},null,{"$f":"IF(ISTEXT(CA197),CM197,\"\")","v":""},null,null,null,{"$f":"IF(ISTEXT(CA197),$DY$2,\"\")","v":""}]
[{"$f":"evidence!A196","v":0},{"$f":"IF(ISTEXT(evidence!B196),evidence!B196,\"\")","v":""},{"$f":"evidence!C196","v":0},{"$f":"evidence!D196","v":0},1918,{"$f":"evidence!E196","v":0},{"$f":"evidence!L196","v":0},{"$f":"evidence!M196","v":0},{"$f":"evidence!N196","v":0},{"$f":"evidence!O196","v":0},{"$f":"evidence!P196","v":0},0,0,0,{"$f":"evidence!Q196","v":"00:00:00"},1900,2016,0,{"$f":"evidence!S196","v":0},"",null,{"$f":"evidence!F196","v":0},{"$f":"evidence!K196","v":0},null,null,null,0,0,0,0,0,0,0,0,0,0,0,0,0,0,0,0,0,0,0,0,0,null,null,null,null,null,0,0,0,0,0,"RODNE_CISLO",0,0,null,null,null,0,0,0,0,"","",0,0,0,0,0,0,null,null,null,null,null,null,null,null,null,null,null,null,null,null,null,null,null,null,null,null,null,null,null,null,null,null,null,null,null,"","","",null,null,"RODNE_CISLO","","",null,null,null,null,null,null,"","",null,null,"",null,"",null,null,null,""]
[{"$f":"evidence!A197","v":0},{"$f":"IF(ISTEXT(evidence!B197),evidence!B197,\"\")","v":""},{"$f":"evidence!C197","v":0},{"$f":"evidence!D197","v":0},1918,{"$f":"evidence!E197","v":0},{"$f":"evidence!L197","v":0},{"$f":"evidence!M197","v":0},{"$f":"evidence!N197","v":0},{"$f":"evidence!O197","v":0},{"$f":"evidence!P197","v":0},0,0,0,{"$f":"evidence!Q197","v":"00:00:00"},1900,2016,0,{"$f":"evidence!S197","v":0},"",null,{"$f":"evidence!F197","v":0},{"$f":"evidence!K197","v":0},null,null,null,0,0,0,0,0,0,0,0,0,0,0,0,0,0,0,0,0,0,0,0,0,null,null,null,null,null,0,0,0,0,0,"RODNE_CISLO",0,0,null,null,null,0,0,0,0,"","",0,0,0,0,0,0,null,null,null,null,null,null,null,null,null,null,null,null,null,null,null,null,null,null,null,null,null,null,null,null,null,null,null,null,null,"","","",null,null,"RODNE_CISLO","","",null,null,null,null,null,null,"","",null,null,"",null,"",null,null,null,""]
[{"$f":"evidence!A198","v":0},{"$f":"IF(ISTEXT(evidence!B198),evidence!B198,\"\")","v":""},{"$f":"evidence!C198","v":0},{"$f":"evidence!D198","v":0},1918,{"$f":"evidence!E198","v":0},{"$f":"evidence!L198","v":0},{"$f":"evidence!M198","v":0},{"$f":"evidence!N198","v":0},{"$f":"evidence!O198","v":0},{"$f":"evidence!P198","v":0},0,0,0,{"$f":"evidence!Q198","v":"00:00:00"},1900,2016,0,{"$f":"evidence!S198","v":0},"",null,{"$f":"evidence!F198","v":0},{"$f":"evidence!K198","v":0},null,null,null,0,0,0,0,0,0,0,0,0,0,0,0,0,0,0,0,0,0,0,0,0,null,null,null,null,null,0,0,0,0,0,"RODNE_CISLO",0,0,null,null,null,0,0,0,0,"","",0,0,0,0,0,0,null,null,null,null,null,null,null,null,null,null,null,null,null,null,null,null,null,null,null,null,null,null,null,null,null,null,null,null,null,"","","",null,null,"RODNE_CISLO","","",null,null,null,null,null,null,"","",null,null,"",null,"",null,null,null,""]
[{"$f":"evidence!A199","v":0},{"$f":"IF(ISTEXT(evidence!B199),evidence!B199,\"\")","v":""},{"$f":"evidence!C199","v":0},{"$f":"evidence!D199","v":0},1918,{"$f":"evidence!E199","v":0},{"$f":"evidence!L199","v":0},{"$f":"evidence!M199","v":0},{"$f":"evidence!N199","v":0},{"$f":"evidence!O199","v":0},{"$f":"evidence!P199","v":0},0,0,0,{"$f":"evidence!Q199","v":"00:00:00"},1900,2016,0,{"$f":"evidence!S199","v":0},"",null,{"$f":"evidence!F199","v":0},{"$f":"evidence!K199","v":0},null,null,null,0,0,0,0,0,0,0,0,0,0,0,0,0,0,0,0,0,0,0,0,0,null,null,null,null,null,0,0,0,0,0,"RODNE_CISLO",0,0,null,null,null,0,0,0,0,"","",0,0,0,0,0,0,null,null,null,null,null,null,null,null,null,null,null,null,null,null,null,null,null,null,null,null,null,null,null,null,null,null,null,null,null,"","","",null,null,"RODNE_CISLO","","",null,null,null,null,null,null,"","",null,null,"",null,"",null,null,null,""]
[{"$f":"evidence!A200","v":0},{"$f":"IF(ISTEXT(evidence!B200),evidence!B200,\"\")","v":""},{"$f":"evidence!C200","v":0},{"$f":"evidence!D200","v":0},1918,{"$f":"evidence!E200","v":0},{"$f":"evidence!L200","v":0},{"$f":"evidence!M200","v":0},{"$f":"evidence!N200","v":0},{"$f":"evidence!O200","v":0},{"$f":"evidence!P200","v":0},0,0,0,{"$f":"evidence!Q200","v":"00:00:00"},1900,2016,0,{"$f":"evidence!S200","v":0},"",null,{"$f":"evidence!F200","v":0},{"$f":"evidence!K200","v":0},null,null,null,0,0,0,0,0,0,0,0,0,0,0,0,0,0,0,0,0,0,0,0,0,null,null,null,null,null,0,0,0,0,0,"RODNE_CISLO",0,0,null,null,null,0,0,0,0,"","",0,0,0,0,0,0,null,null,null,null,null,null,null,null,null,null,null,null,null,null,null,null,null,null,null,null,null,null,null,null,null,null,null,null,null,"","","",null,null,"RODNE_CISLO","","",null,null,null,null,null,null,"","",null,null,"",null,"",null,null,null,""]
[{"$f":"evidence!A201","v":0},{"$f":"IF(ISTEXT(evidence!B201),evidence!B201,\"\")","v":""},{"$f":"evidence!C201","v":0},{"$f":"evidence!D201","v":0},1918,{"$f":"evidence!E201","v":0},{"$f":"evidence!L201","v":0},{"$f":"evidence!M201","v":0},{"$f":"evidence!N201","v":0},{"$f":"evidence!O201","v":0},{"$f":"evidence!P201","v":0},0,0,0,{"$f":"evidence!Q201","v":"00:00:00"},1900,2016,0,{"$f":"evidence!S201","v":0},"",null,{"$f":"evidence!F201","v":0},{"$f":"evidence!K201","v":0},null,null,null,0,0,0,0,0,0,0,0,0,0,0,0,0,0,0,0,0,0,0,0,0,null,null,null,null,null,0,0,0,0,0,"RODNE_CISLO",0,0,null,null,null,0,0,0,0,"","",0,0,0,0,0,0,null,null,null,null,null,null,null,null,null,null,null,null,null,null,null,null,null,null,null,null,null,null,null,null,null,null,null,null,null,"","","",null,null,"RODNE_CISLO","","",null,null,null,null,null,null,"","",null,null,"",null,"",null,null,null,""]
[{"$f":"evidence!A202","v":0},{"$f":"IF(ISTEXT(evidence!B202),evidence!B202,\"\")","v":""},{"$f":"evidence!C202","v":0},{"$f":"evidence!D202","v":0},1918,{"$f":"evidence!E202","v":0},{"$f":"evidence!L202","v":0},{"$f":"evidence!M202","v":0},{"$f":"evidence!N202","v":0},{"$f":"evidence!O202","v":0},{"$f":"evidence!P202","v":0},0,0,0,{"$f":"evidence!Q202","v":"00:00:00"},1900,2016,0,{"$f":"evidence!S202","v":0},"",null,{"$f":"evidence!F202","v":0},{"$f":"evidence!K202","v":0},null,null,null,0,0,0,0,0,0,0,0,0,0,0,0,0,0,0,0,0,0,0,0,0,null,null,null,null,null,0,0,0,0,0,"RODNE_CISLO",0,0,null,null,null,0,0,0,0,"","",0,0,0,0,0,0,null,null,null,null,null,null,null,null,null,null,null,null,null,null,null,null,null,null,null,null,null,null,null,null,null,null,null,null,null,"","","",null,null,"RODNE_CISLO","","",null,null,null,null,null,null,"","",null,null,"",null,"",null,null,null,""]
[{"$f":"evidence!A203","v":0},{"$f":"IF(ISTEXT(evidence!B203),evidence!B203,\"\")","v":""},{"$f":"evidence!C203","v":0},{"$f":"evidence!D203","v":0},1918,{"$f":"evidence!E203","v":0},{"$f":"evidence!L203","v":0},{"$f":"evidence!M203","v":0},{"$f":"evidence!N203","v":0},{"$f":"evidence!O203","v":0},{"$f":"evidence!P203","v":0},0,0,0,{"$f":"evidence!Q203","v":"00:00:00"},1900,2016,0,{"$f":"evidence!S203","v":0},"",null,{"$f":"evidence!F203","v":0},{"$f":"evidence!K203","v":0},null,null,null,0,0,0,0,0,0,0,0,0,0,0,0,0,0,0,0,0,0,0,0,0,null,null,null,null,null,0,0,0,0,0,"RODNE_CISLO",0,0,null,null,null,0,0,0,0,"","",0,0,0,0,0,0,null,null,null,null,null,null,null,null,null,null,null,null,null,null,null,null,null,null,null,null,null,null,null,null,null,null,null,null,null,"","","",null,null,"RODNE_CISLO","","",null,null,null,null,null,null,"","",null,null,"",null,"",null,null,null,""]
[{"$f":"evidence!A204","v":0},{"$f":"IF(ISTEXT(evidence!B204),evidence!B204,\"\")","v":""},{"$f":"evidence!C204","v":0},{"$f":"evidence!D204","v":0},1918,{"$f":"evidence!E204","v":0},{"$f":"evidence!L204","v":0},{"$f":"evidence!M204","v":0},{"$f":"evidence!N204","v":0},{"$f":"evidence!O204","v":0},{"$f":"evidence!P204","v":0},0,0,0,{"$f":"evidence!Q204","v":"00:00:00"},1900,2016,0,{"$f":"evidence!S204","v":0},"",null,{"$f":"evidence!F204","v":0},{"$f":"evidence!K204","v":0},null,null,null,0,0,0,0,0,0,0,0,0,0,0,0,0,0,0,0,0,0,0,0,0,null,null,null,null,null,0,0,0,0,0,"RODNE_CISLO",0,0,null,null,null,0,0,0,0,"","",0,0,0,0,0,0,null,null,null,null,null,null,null,null,null,null,null,null,null,null,null,null,null,null,null,null,null,null,null,null,null,null,null,null,null,"","","",null,null,"RODNE_CISLO","","",null,null,null,null,null,null,"","",null,null,"",null,"",null,null,null,""]
[{"$f":"evidence!A205","v":0},{"$f":"IF(ISTEXT(evidence!B205),evidence!B205,\"\")","v":""},{"$f":"evidence!C205","v":0},{"$f":"evidence!D205","v":0},1918,{"$f":"evidence!E205","v":0},{"$f":"evidence!L205","v":0},{"$f":"evidence!M205","v":0},{"$f":"evidence!N205","v":0},{"$f":"evidence!O205","v":0},{"$f":"evidence!P205","v":0},0,0,0,{"$f":"evidence!Q205","v":"00:00:00"},1900,2016,0,{"$f":"evidence!S205","v":0},"",null,{"$f":"evidence!F205","v":0},{"$f":"evidence!K205","v":0},null,null,null,0,0,0,0,0,0,0,0,0,0,0,0,0,0,0,0,0,0,0,0,0,null,null,null,null,null,0,0,0,0,0,"RODNE_CISLO",0,0,null,null,null,0,0,0,0,"","",0,0,0,0,0,0,null,null,null,null,null,null,null,null,null,null,null,null,null,null,null,null,null,null,null,null,null,null,null,null,null,null,null,null,null,"","","",null,null,"RODNE_CISLO","","",null,null,null,null,null,null,"","",null,null,"",null,"",null,null,null,""]
[{"$f":"evidence!A206","v":0},{"$f":"IF(ISTEXT(evidence!B206),evidence!B206,\"\")","v":""},{"$f":"evidence!C206","v":0},{"$f":"evidence!D206","v":0},1918,{"$f":"evidence!E206","v":0},{"$f":"evidence!L206","v":0},{"$f":"evidence!M206","v":0},{"$f":"evidence!N206","v":0},{"$f":"evidence!O206","v":0},{"$f":"evidence!P206","v":0},0,0,0,{"$f":"evidence!Q206","v":"00:00:00"},1900,2016,0,{"$f":"evidence!S206","v":0},"",null,{"$f":"evidence!F206","v":0},{"$f":"evidence!K206","v":0},null,null,null,0,0,0,0,0,0,0,0,0,0,0,0,0,0,0,0,0,0,0,0,0,null,null,null,null,null,0,0,0,0,0,"RODNE_CISLO",0,0,null,null,null,0,0,0,0,"","",0,0,0,0,0,0,null,null,null,null,null,null,null,null,null,null,null,null,null,null,null,null,null,null,null,null,null,null,null,null,null,null,null,null,null,"","","",null,null,"RODNE_CISLO","","",null,null,null,null,null,null,"","",null,null,"",null,"",null,null,null,""]
[{"$f":"evidence!A207","v":0},{"$f":"IF(ISTEXT(evidence!B207),evidence!B207,\"\")","v":""},{"$f":"evidence!C207","v":0},{"$f":"evidence!D207","v":0},1918,{"$f":"evidence!E207","v":0},{"$f":"evidence!L207","v":0},{"$f":"evidence!M207","v":0},{"$f":"evidence!N207","v":0},{"$f":"evidence!O207","v":0},{"$f":"evidence!P207","v":0},0,0,0,{"$f":"evidence!Q207","v":"00:00:00"},1900,2016,0,{"$f":"evidence!S207","v":0},"",null,{"$f":"evidence!F207","v":0},{"$f":"evidence!K207","v":0},null,null,null,0,0,0,0,0,0,0,0,0,0,0,0,0,0,0,0,0,0,0,0,0,null,null,null,null,null,0,0,0,0,0,"RODNE_CISLO",0,0,null,null,null,0,0,0,0,"","",0,0,0,0,0,0,null,null,null,null,null,null,null,null,null,null,null,null,null,null,null,null,null,null,null,null,null,null,null,null,null,null,null,null,null,"","","",null,null,"RODNE_CISLO","","",null,null,null,null,null,null,"","",null,null,"",null,"",null,null,null,""]
[{"$f":"evidence!A208","v":0},{"$f":"IF(ISTEXT(evidence!B208),evidence!B208,\"\")","v":""},{"$f":"evidence!C208","v":0},{"$f":"evidence!D208","v":0},1918,{"$f":"evidence!E208","v":0},{"$f":"evidence!L208","v":0},{"$f":"evidence!M208","v":0},{"$f":"evidence!N208","v":0},{"$f":"evidence!O208","v":0},{"$f":"evidence!P208","v":0},0,0,0,{"$f":"evidence!Q208","v":"00:00:00"},1900,2016,0,{"$f":"evidence!S208","v":0},"",null,{"$f":"evidence!F208","v":0},{"$f":"evidence!K208","v":0},null,null,null,0,0,0,0,0,0,0,0,0,0,0,0,0,0,0,0,0,0,0,0,0,null,null,null,null,null,0,0,0,0,0,"RODNE_CISLO",0,0,null,null,null,0,0,0,0,"","",0,0,0,0,0,0,null,null,null,null,null,null,null,null,null,null,null,null,null,null,null,null,null,null,null,null,null,null,null,null,null,null,null,null,null,"","","",null,null,"RODNE_CISLO","","",null,null,null,null,null,null,"","",null,null,"",null,"",null,null,null,""]
[{"$f":"evidence!A209","v":0},{"$f":"IF(ISTEXT(evidence!B209),evidence!B209,\"\")","v":""},{"$f":"evidence!C209","v":0},{"$f":"evidence!D209","v":0},1918,{"$f":"evidence!E209","v":0},{"$f":"evidence!L209","v":0},{"$f":"evidence!M209","v":0},{"$f":"evidence!N209","v":0},{"$f":"evidence!O209","v":0},{"$f":"evidence!P209","v":0},0,0,0,{"$f":"evidence!Q209","v":"00:00:00"},1900,2016,0,{"$f":"evidence!S209","v":0},"",null,{"$f":"evidence!F209","v":0},{"$f":"evidence!K209","v":0},null,null,null,0,0,0,0,0,0,0,0,0,0,0,0,0,0,0,0,0,0,0,0,0,null,null,null,null,null,0,0,0,0,0,"RODNE_CISLO",0,0,null,null,null,0,0,0,0,"","",0,0,0,0,0,0,null,null,null,null,null,null,null,null,null,null,null,null,null,null,null,null,null,null,null,null,null,null,null,null,null,null,null,null,null,"","","",null,null,"RODNE_CISLO","","",null,null,null,null,null,null,"","",null,null,"",null,"",null,null,null,""]
[{"$f":"evidence!A210","v":0},{"$f":"IF(ISTEXT(evidence!B210),evidence!B210,\"\")","v":""},{"$f":"evidence!C210","v":0},{"$f":"evidence!D210","v":0},1918,{"$f":"evidence!E210","v":0},{"$f":"evidence!L210","v":0},{"$f":"evidence!M210","v":0},{"$f":"evidence!N210","v":0},{"$f":"evidence!O210","v":0},{"$f":"evidence!P210","v":0},0,0,0,{"$f":"evidence!Q210","v":"00:00:00"},1900,2016,0,{"$f":"evidence!S210","v":0},"",null,{"$f":"evidence!F210","v":0},{"$f":"evidence!K210","v":0},null,null,null,0,0,0,0,0,0,0,0,0,0,0,0,0,0,0,0,0,0,0,0,0,null,null,null,null,null,0,0,0,0,0,"RODNE_CISLO",0,0,null,null,null,0,0,0,0,"","",0,0,0,0,0,0,null,null,null,null,null,null,null,null,null,null,null,null,null,null,null,null,null,null,null,null,null,null,null,null,null,null,null,null,null,"","","",null,null,"RODNE_CISLO","","",null,null,null,null,null,null,"","",null,null,"",null,"",null,null,null,""]
[{"$f":"evidence!A211","v":0},{"$f":"IF(ISTEXT(evidence!B211),evidence!B211,\"\")","v":""},{"$f":"evidence!C211","v":0},{"$f":"evidence!D211","v":0},1918,{"$f":"evidence!E211","v":0},{"$f":"evidence!L211","v":0},{"$f":"evidence!M211","v":0},{"$f":"evidence!N211","v":0},{"$f":"evidence!O211","v":0},{"$f":"evidence!P211","v":0},0,0,0,{"$f":"evidence!Q211","v":"00:00:00"},1900,2016,0,{"$f":"evidence!S211","v":0},"",null,{"$f":"evidence!F211","v":0},{"$f":"evidence!K211","v":0},null,null,null,0,0,0,0,0,0,0,0,0,0,0,0,0,0,0,0,0,0,0,0,0,null,null,null,null,null,0,0,0,0,0,"RODNE_CISLO",0,0,null,null,null,0,0,0,0,"","",0,0,0,0,0,0,null,null,null,null,null,null,null,null,null,null,null,null,null,null,null,null,null,null,null,null,null,null,null,null,null,null,null,null,null,"","","",null,null,"RODNE_CISLO","","",null,null,null,null,null,null,"","",null,null,"",null,"",null,null,null,""]
[{"$f":"evidence!A212","v":0},{"$f":"IF(ISTEXT(evidence!B212),evidence!B212,\"\")","v":""},{"$f":"evidence!C212","v":0},{"$f":"evidence!D212","v":0},1918,{"$f":"evidence!E212","v":0},{"$f":"evidence!L212","v":0},{"$f":"evidence!M212","v":0},{"$f":"evidence!N212","v":0},{"$f":"evidence!O212","v":0},{"$f":"evidence!P212","v":0},0,0,0,{"$f":"evidence!Q212","v":"00:00:00"},1900,2016,0,{"$f":"evidence!S212","v":0},"",null,{"$f":"evidence!F212","v":0},{"$f":"evidence!K212","v":0},null,null,null,0,0,0,0,0,0,0,0,0,0,0,0,0,0,0,0,0,0,0,0,0,null,null,null,null,null,0,0,0,0,0,"RODNE_CISLO",0,0,null,null,null,0,0,0,0,"","",0,0,0,0,0,0,null,null,null,null,null,null,null,null,null,null,null,null,null,null,null,null,null,null,null,null,null,null,null,null,null,null,null,null,null,"","","",null,null,"RODNE_CISLO","","",null,null,null,null,null,null,"","",null,null,"",null,"",null,null,null,""]
[{"$f":"evidence!A213","v":0},{"$f":"IF(ISTEXT(evidence!B213),evidence!B213,\"\")","v":""},{"$f":"evidence!C213","v":0},{"$f":"evidence!D213","v":0},1918,{"$f":"evidence!E213","v":0},{"$f":"evidence!L213","v":0},{"$f":"evidence!M213","v":0},{"$f":"evidence!N213","v":0},{"$f":"evidence!O213","v":0},{"$f":"evidence!P213","v":0},0,0,0,{"$f":"evidence!Q213","v":"00:00:00"},1900,2016,0,{"$f":"evidence!S213","v":0},"",null,{"$f":"evidence!F213","v":0},{"$f":"evidence!K213","v":0},null,null,null,0,0,0,0,0,0,0,0,0,0,0,0,0,0,0,0,0,0,0,0,0,null,null,null,null,null,0,0,0,0,0,"RODNE_CISLO",0,0,null,null,null,0,0,0,0,"","",0,0,0,0,0,0,null,null,null,null,null,null,null,null,null,null,null,null,null,null,null,null,null,null,null,null,null,null,null,null,null,null,null,null,null,"","","",null,null,"RODNE_CISLO","","",null,null,null,null,null,null,"","",null,null,"",null,"",null,null,null,""]
[{"$f":"evidence!A214","v":0},{"$f":"IF(ISTEXT(evidence!B214),evidence!B214,\"\")","v":""},{"$f":"evidence!C214","v":0},{"$f":"evidence!D214","v":0},1918,{"$f":"evidence!E214","v":0},{"$f":"evidence!L214","v":0},{"$f":"evidence!M214","v":0},{"$f":"evidence!N214","v":0},{"$f":"evidence!O214","v":0},{"$f":"evidence!P214","v":0},0,0,0,{"$f":"evidence!Q214","v":"00:00:00"},1900,2016,0,{"$f":"evidence!S214","v":0},"",null,{"$f":"evidence!F214","v":0},{"$f":"evidence!K214","v":0},null,null,null,0,0,0,0,0,0,0,0,0,0,0,0,0,0,0,0,0,0,0,0,0,null,null,null,null,null,0,0,0,0,0,"RODNE_CISLO",0,0,null,null,null,0,0,0,0,"","",0,0,0,0,0,0,null,null,null,null,null,null,null,null,null,null,null,null,null,null,null,null,null,null,null,null,null,null,null,null,null,null,null,null,null,"","","",null,null,"RODNE_CISLO","","",null,null,null,null,null,null,"","",null,null,"",null,"",null,null,null,""]
[{"$f":"evidence!A215","v":0},{"$f":"IF(ISTEXT(evidence!B215),evidence!B215,\"\")","v":""},{"$f":"evidence!C215","v":0},{"$f":"evidence!D215","v":0},1918,{"$f":"evidence!E215","v":0},{"$f":"evidence!L215","v":0},{"$f":"evidence!M215","v":0},{"$f":"evidence!N215","v":0},{"$f":"evidence!O215","v":0},{"$f":"evidence!P215","v":0},0,0,0,{"$f":"evidence!Q215","v":"00:00:00"},1900,2016,0,{"$f":"evidence!S215","v":0},"",null,{"$f":"evidence!F215","v":0},{"$f":"evidence!K215","v":0},null,null,null,0,0,0,0,0,0,0,0,0,0,0,0,0,0,0,0,0,0,0,0,0,null,null,null,null,null,0,0,0,0,0,"RODNE_CISLO",0,0,null,null,null,0,0,0,0,"","",0,0,0,0,0,0,null,null,null,null,null,null,null,null,null,null,null,null,null,null,null,null,null,null,null,null,null,null,null,null,null,null,null,null,null,"","","",null,null,"RODNE_CISLO","","",null,null,null,null,null,null,"","",null,null,"",null,"",null,null,null,""]
[{"$f":"evidence!A216","v":0},{"$f":"IF(ISTEXT(evidence!B216),evidence!B216,\"\")","v":""},{"$f":"evidence!C216","v":0},{"$f":"evidence!D216","v":0},1918,{"$f":"evidence!E216","v":0},{"$f":"evidence!L216","v":0},{"$f":"evidence!M216","v":0},{"$f":"evidence!N216","v":0},{"$f":"evidence!O216","v":0},{"$f":"evidence!P216","v":0},0,0,0,{"$f":"evidence!Q216","v":"00:00:00"},1900,2016,0,{"$f":"evidence!S216","v":0},"",null,{"$f":"evidence!F216","v":0},{"$f":"evidence!K216","v":0},null,null,null,0,0,0,0,0,0,0,0,0,0,0,0,0,0,0,0,0,0,0,0,0,null,null,null,null,null,0,0,0,0,0,"RODNE_CISLO",0,0,null,null,null,0,0,0,0,"","",0,0,0,0,0,0,null,null,null,null,null,null,null,null,null,null,null,null,null,null,null,null,null,null,null,null,null,null,null,null,null,null,null,null,null,"","","",null,null,"RODNE_CISLO","","",null,null,null,null,null,null,"","",null,null,"",null,"",null,null,null,""]
[{"$f":"evidence!A217","v":0},{"$f":"IF(ISTEXT(evidence!B217),evidence!B217,\"\")","v":""},{"$f":"evidence!C217","v":0},{"$f":"evidence!D217","v":0},1918,{"$f":"evidence!E217","v":0},{"$f":"evidence!L217","v":0},{"$f":"evidence!M217","v":0},{"$f":"evidence!N217","v":0},{"$f":"evidence!O217","v":0},{"$f":"evidence!P217","v":0},0,0,0,{"$f":"evidence!Q217","v":"00:00:00"},1900,2016,0,{"$f":"evidence!S217","v":0},"",null,{"$f":"evidence!F217","v":0},{"$f":"evidence!K217","v":0},null,null,null,0,0,0,0,0,0,0,0,0,0,0,0,0,0,0,0,0,0,0,0,0,null,null,null,null,null,0,0,0,0,0,"RODNE_CISLO",0,0,null,null,null,0,0,0,0,"","",0,0,0,0,0,0,null,null,null,null,null,null,null,null,null,null,null,null,null,null,null,null,null,null,null,null,null,null,null,null,null,null,null,null,null,"","","",null,null,"RODNE_CISLO","","",null,null,null,null,null,null,"","",null,null,"",null,"",null,null,null,""]
[{"$f":"evidence!A218","v":0},{"$f":"IF(ISTEXT(evidence!B218),evidence!B218,\"\")","v":""},{"$f":"evidence!C218","v":0},{"$f":"evidence!D218","v":0},1918,{"$f":"evidence!E218","v":0},{"$f":"evidence!L218","v":0},{"$f":"evidence!M218","v":0},{"$f":"evidence!N218","v":0},{"$f":"evidence!O218","v":0},{"$f":"evidence!P218","v":0},0,0,0,{"$f":"evidence!Q218","v":"00:00:00"},1900,2016,0,{"$f":"evidence!S218","v":0},"",null,{"$f":"evidence!F218","v":0},{"$f":"evidence!K218","v":0},null,null,null,0,0,0,0,0,0,0,0,0,0,0,0,0,0,0,0,0,0,0,0,0,null,null,null,null,null,0,0,0,0,0,"RODNE_CISLO",0,0,null,null,null,0,0,0,0,"","",0,0,0,0,0,0,null,null,null,null,null,null,null,null,null,null,null,null,null,null,null,null,null,null,null,null,null,null,null,null,null,null,null,null,null,"","","",null,null,"RODNE_CISLO","","",null,null,null,null,null,null,"","",null,null,"",null,"",null,null,null,""]
[{"$f":"evidence!A219","v":0},{"$f":"IF(ISTEXT(evidence!B219),evidence!B219,\"\")","v":""},{"$f":"evidence!C219","v":0},{"$f":"evidence!D219","v":0},1918,{"$f":"evidence!E219","v":0},{"$f":"evidence!L219","v":0},{"$f":"evidence!M219","v":0},{"$f":"evidence!N219","v":0},{"$f":"evidence!O219","v":0},{"$f":"evidence!P219","v":0},0,0,0,{"$f":"evidence!Q219","v":"00:00:00"},1900,2016,0,{"$f":"evidence!S219","v":0},"",null,{"$f":"evidence!F219","v":0},{"$f":"evidence!K219","v":0},null,null,null,0,0,0,0,0,0,0,0,0,0,0,0,0,0,0,0,0,0,0,0,0,null,null,null,null,null,0,0,0,0,0,"RODNE_CISLO",0,0,null,null,null,0,0,0,0,"","",0,0,0,0,0,0,null,null,null,null,null,null,null,null,null,null,null,null,null,null,null,null,null,null,null,null,null,null,null,null,null,null,null,null,null,"","","",null,null,"RODNE_CISLO","","",null,null,null,null,null,null,"","",null,null,"",null,"",null,null,null,""]
[{"$f":"evidence!A220","v":0},{"$f":"IF(ISTEXT(evidence!B220),evidence!B220,\"\")","v":""},{"$f":"evidence!C220","v":0},{"$f":"evidence!D220","v":0},1918,{"$f":"evidence!E220","v":0},{"$f":"evidence!L220","v":0},{"$f":"evidence!M220","v":0},{"$f":"evidence!N220","v":0},{"$f":"evidence!O220","v":0},{"$f":"evidence!P220","v":0},0,0,0,{"$f":"evidence!Q220","v":"00:00:00"},1900,2016,0,{"$f":"evidence!S220","v":0},"",null,{"$f":"evidence!F220","v":0},{"$f":"evidence!K220","v":0},null,null,null,0,0,0,0,0,0,0,0,0,0,0,0,0,0,0,0,0,0,0,0,0,null,null,null,null,null,0,0,0,0,0,"RODNE_CISLO",0,0,null,null,null,0,0,0,0,"","",0,0,0,0,0,0,null,null,null,null,null,null,null,null,null,null,null,null,null,null,null,null,null,null,null,null,null,null,null,null,null,null,null,null,null,"","","",null,null,"RODNE_CISLO","","",null,null,null,null,null,null,"","",null,null,"",null,"",null,null,null,""]
[{"$f":"evidence!A221","v":0},{"$f":"IF(ISTEXT(evidence!B221),evidence!B221,\"\")","v":""},{"$f":"evidence!C221","v":0},{"$f":"evidence!D221","v":0},1918,{"$f":"evidence!E221","v":0},{"$f":"evidence!L221","v":0},{"$f":"evidence!M221","v":0},{"$f":"evidence!N221","v":0},{"$f":"evidence!O221","v":0},{"$f":"evidence!P221","v":0},0,0,0,{"$f":"evidence!Q221","v":"00:00:00"},1900,2016,0,{"$f":"evidence!S221","v":0},"",null,{"$f":"evidence!F221","v":0},{"$f":"evidence!K221","v":0},null,null,null,0,0,0,0,0,0,0,0,0,0,0,0,0,0,0,0,0,0,0,0,0,null,null,null,null,null,0,0,0,0,0,"RODNE_CISLO",0,0,null,null,null,0,0,0,0,"","",0,0,0,0,0,0,null,null,null,null,null,null,null,null,null,null,null,null,null,null,null,null,null,null,null,null,null,null,null,null,null,null,null,null,null,"","","",null,null,"RODNE_CISLO","","",null,null,null,null,null,null,"","",null,null,"",null,"",null,null,null,""]
[{"$f":"evidence!A222","v":0},{"$f":"IF(ISTEXT(evidence!B222),evidence!B222,\"\")","v":""},{"$f":"evidence!C222","v":0},{"$f":"evidence!D222","v":0},1918,{"$f":"evidence!E222","v":0},{"$f":"evidence!L222","v":0},{"$f":"evidence!M222","v":0},{"$f":"evidence!N222","v":0},{"$f":"evidence!O222","v":0},{"$f":"evidence!P222","v":0},0,0,0,{"$f":"evidence!Q222","v":"00:00:00"},1900,2016,0,{"$f":"evidence!S222","v":0},"",null,{"$f":"evidence!F222","v":0},{"$f":"evidence!K222","v":0},null,null,null,0,0,0,0,0,0,0,0,0,0,0,0,0,0,0,0,0,0,0,0,0,null,null,null,null,null,0,0,0,0,0,"RODNE_CISLO",0,0,null,null,null,0,0,0,0,"","",0,0,0,0,0,0,null,null,null,null,null,null,null,null,null,null,null,null,null,null,null,null,null,null,null,null,null,null,null,null,null,null,null,null,null,"","","",null,null,"RODNE_CISLO","","",null,null,null,null,null,null,"","",null,null,"",null,"",null,null,null,""]
[{"$f":"evidence!A223","v":0},{"$f":"IF(ISTEXT(evidence!B223),evidence!B223,\"\")","v":""},{"$f":"evidence!C223","v":0},{"$f":"evidence!D223","v":0},1918,{"$f":"evidence!E223","v":0},{"$f":"evidence!L223","v":0},{"$f":"evidence!M223","v":0},{"$f":"evidence!N223","v":0},{"$f":"evidence!O223","v":0},{"$f":"evidence!P223","v":0},0,0,0,{"$f":"evidence!Q223","v":"00:00:00"},1900,2016,0,{"$f":"evidence!S223","v":0},"",null,{"$f":"evidence!F223","v":0},{"$f":"evidence!K223","v":0},null,null,null,0,0,0,0,0,0,0,0,0,0,0,0,0,0,0,0,0,0,0,0,0,null,null,null,null,null,0,0,0,0,0,"RODNE_CISLO",0,0,null,null,null,0,0,0,0,"","",0,0,0,0,0,0,null,null,null,null,null,null,null,null,null,null,null,null,null,null,null,null,null,null,null,null,null,null,null,null,null,null,null,null,null,"","","",null,null,"RODNE_CISLO","","",null,null,null,null,null,null,"","",null,null,"",null,"",null,null,null,""]
[{"$f":"evidence!A224","v":0},{"$f":"IF(ISTEXT(evidence!B224),evidence!B224,\"\")","v":""},{"$f":"evidence!C224","v":0},{"$f":"evidence!D224","v":0},1918,{"$f":"evidence!E224","v":0},{"$f":"evidence!L224","v":0},{"$f":"evidence!M224","v":0},{"$f":"evidence!N224","v":0},{"$f":"evidence!O224","v":0},{"$f":"evidence!P224","v":0},0,0,0,{"$f":"evidence!Q224","v":"00:00:00"},1900,2016,0,{"$f":"evidence!S224","v":0},"",null,{"$f":"evidence!F224","v":0},{"$f":"evidence!K224","v":0},null,null,null,0,0,0,0,0,0,0,0,0,0,0,0,0,0,0,0,0,0,0,0,0,null,null,null,null,null,0,0,0,0,0,"RODNE_CISLO",0,0,null,null,null,0,0,0,0,"","",0,0,0,0,0,0,null,null,null,null,null,null,null,null,null,null,null,null,null,null,null,null,null,null,null,null,null,null,null,null,null,null,null,null,null,"","","",null,null,"RODNE_CISLO","","",null,null,null,null,null,null,"","",null,null,"",null,"",null,null,null,""]
[{"$f":"evidence!A225","v":0},{"$f":"IF(ISTEXT(evidence!B225),evidence!B225,\"\")","v":""},{"$f":"evidence!C225","v":0},{"$f":"evidence!D225","v":0},1918,{"$f":"evidence!E225","v":0},{"$f":"evidence!L225","v":0},{"$f":"evidence!M225","v":0},{"$f":"evidence!N225","v":0},{"$f":"evidence!O225","v":0},{"$f":"evidence!P225","v":0},0,0,0,{"$f":"evidence!Q225","v":"00:00:00"},1900,2016,0,{"$f":"evidence!S225","v":0},"",null,{"$f":"evidence!F225","v":0},{"$f":"evidence!K225","v":0},null,null,null,0,0,0,0,0,0,0,0,0,0,0,0,0,0,0,0,0,0,0,0,0,null,null,null,null,null,0,0,0,0,0,"RODNE_CISLO",0,0,null,null,null,0,0,0,0,"","",0,0,0,0,0,0,null,null,null,null,null,null,null,null,null,null,null,null,null,null,null,null,null,null,null,null,null,null,null,null,null,null,null,null,null,"","","",null,null,"RODNE_CISLO","","",null,null,null,null,null,null,"","",null,null,"",null,"",null,null,null,""]
[{"$f":"evidence!A226","v":0},{"$f":"IF(ISTEXT(evidence!B226),evidence!B226,\"\")","v":""},{"$f":"evidence!C226","v":0},{"$f":"evidence!D226","v":0},1918,{"$f":"evidence!E226","v":0},{"$f":"evidence!L226","v":0},{"$f":"evidence!M226","v":0},{"$f":"evidence!N226","v":0},{"$f":"evidence!O226","v":0},{"$f":"evidence!P226","v":0},0,0,0,{"$f":"evidence!Q226","v":"00:00:00"},1900,2016,0,{"$f":"evidence!S226","v":0},"",null,{"$f":"evidence!F226","v":0},{"$f":"evidence!K226","v":0},null,null,null,0,0,0,0,0,0,0,0,0,0,0,0,0,0,0,0,0,0,0,0,0,null,null,null,null,null,0,0,0,0,0,"RODNE_CISLO",0,0,null,null,null,0,0,0,0,"","",0,0,0,0,0,0,null,null,null,null,null,null,null,null,null,null,null,null,null,null,null,null,null,null,null,null,null,null,null,null,null,null,null,null,null,"","","",null,null,"RODNE_CISLO","","",null,null,null,null,null,null,"","",null,null,"",null,"",null,null,null,""]
[{"$f":"evidence!A227","v":0},{"$f":"IF(ISTEXT(evidence!B227),evidence!B227,\"\")","v":""},{"$f":"evidence!C227","v":0},{"$f":"evidence!D227","v":0},1918,{"$f":"evidence!E227","v":0},{"$f":"evidence!L227","v":0},{"$f":"evidence!M227","v":0},{"$f":"evidence!N227","v":0},{"$f":"evidence!O227","v":0},{"$f":"evidence!P227","v":0},0,0,0,{"$f":"evidence!Q227","v":"00:00:00"},1900,2016,0,{"$f":"evidence!S227","v":0},"",null,{"$f":"evidence!F227","v":0},{"$f":"evidence!K227","v":0},null,null,null,0,0,0,0,0,0,0,0,0,0,0,0,0,0,0,0,0,0,0,0,0,null,null,null,null,null,0,0,0,0,0,"RODNE_CISLO",0,0,null,null,null,0,0,0,0,"","",0,0,0,0,0,0,null,null,null,null,null,null,null,null,null,null,null,null,null,null,null,null,null,null,null,null,null,null,null,null,null,null,null,null,null,"","","",null,null,"RODNE_CISLO","","",null,null,null,null,null,null,"","",null,null,"",null,"",null,null,null,""]
[{"$f":"evidence!A228","v":0},{"$f":"IF(ISTEXT(evidence!B228),evidence!B228,\"\")","v":""},{"$f":"evidence!C228","v":0},{"$f":"evidence!D228","v":0},1918,{"$f":"evidence!E228","v":0},{"$f":"evidence!L228","v":0},{"$f":"evidence!M228","v":0},{"$f":"evidence!N228","v":0},{"$f":"evidence!O228","v":0},{"$f":"evidence!P228","v":0},0,0,0,{"$f":"evidence!Q228","v":"00:00:00"},1900,2016,0,{"$f":"evidence!S228","v":0},"",null,{"$f":"evidence!F228","v":0},{"$f":"evidence!K228","v":0},null,null,null,0,0,0,0,0,0,0,0,0,0,0,0,0,0,0,0,0,0,0,0,0,null,null,null,null,null,0,0,0,0,0,"RODNE_CISLO",0,0,null,null,null,0,0,0,0,"","",0,0,0,0,0,0,null,null,null,null,null,null,null,null,null,null,null,null,null,null,null,null,null,null,null,null,null,null,null,null,null,null,null,null,null,"","","",null,null,"RODNE_CISLO","","",null,null,null,null,null,null,"","",null,null,"",null,"",null,null,null,""]
[{"$f":"evidence!A229","v":0},{"$f":"IF(ISTEXT(evidence!B229),evidence!B229,\"\")","v":""},{"$f":"evidence!C229","v":0},{"$f":"evidence!D229","v":0},1918,{"$f":"evidence!E229","v":0},{"$f":"evidence!L229","v":0},{"$f":"evidence!M229","v":0},{"$f":"evidence!N229","v":0},{"$f":"evidence!O229","v":0},{"$f":"evidence!P229","v":0},0,0,0,{"$f":"evidence!Q229","v":"00:00:00"},1900,2016,0,{"$f":"evidence!S229","v":0},"",null,{"$f":"evidence!F229","v":0},{"$f":"evidence!K229","v":0},null,null,null,0,0,0,0,0,0,0,0,0,0,0,0,0,0,0,0,0,0,0,0,0,null,null,null,null,null,0,0,0,0,0,"RODNE_CISLO",0,0,null,null,null,0,0,0,0,"","",0,0,0,0,0,0,null,null,null,null,null,null,null,null,null,null,null,null,null,null,null,null,null,null,null,null,null,null,null,null,null,null,null,null,null,"","","",null,null,"RODNE_CISLO","","",null,null,null,null,null,null,"","",null,null,"",null,"",null,null,null,""]
[{"$f":"evidence!A230","v":0},{"$f":"IF(ISTEXT(evidence!B230),evidence!B230,\"\")","v":""},{"$f":"evidence!C230","v":0},{"$f":"evidence!D230","v":0},1918,{"$f":"evidence!E230","v":0},{"$f":"evidence!L230","v":0},{"$f":"evidence!M230","v":0},{"$f":"evidence!N230","v":0},{"$f":"evidence!O230","v":0},{"$f":"evidence!P230","v":0},0,0,0,{"$f":"evidence!Q230","v":"00:00:00"},1900,2016,0,{"$f":"evidence!S230","v":0},"",null,{"$f":"evidence!F230","v":0},{"$f":"evidence!K230","v":0},null,null,null,0,0,0,0,0,0,0,0,0,0,0,0,0,0,0,0,0,0,0,0,0,null,null,null,null,null,0,0,0,0,0,"RODNE_CISLO",0,0,null,null,null,0,0,0,0,"","",0,0,0,0,0,0,null,null,null,null,null,null,null,null,null,null,null,null,null,null,null,null,null,null,null,null,null,null,null,null,null,null,null,null,null,"","","",null,null,"RODNE_CISLO","","",null,null,null,null,null,null,"","",null,null,"",null,"",null,null,null,""]
[{"$f":"evidence!A231","v":0},{"$f":"IF(ISTEXT(evidence!B231),evidence!B231,\"\")","v":""},{"$f":"evidence!C231","v":0},{"$f":"evidence!D231","v":0},1918,{"$f":"evidence!E231","v":0},{"$f":"evidence!L231","v":0},{"$f":"evidence!M231","v":0},{"$f":"evidence!N231","v":0},{"$f":"evidence!O231","v":0},{"$f":"evidence!P231","v":0},0,0,0,{"$f":"evidence!Q231","v":"00:00:00"},1900,2016,0,{"$f":"evidence!S231","v":0},"",null,{"$f":"evidence!F231","v":0},{"$f":"evidence!K231","v":0},null,null,null,0,0,0,0,0,0,0,0,0,0,0,0,0,0,0,0,0,0,0,0,0,null,null,null,null,null,0,0,0,0,0,"RODNE_CISLO",0,0,null,null,null,0,0,0,0,"","",0,0,0,0,0,0,null,null,null,null,null,null,null,null,null,null,null,null,null,null,null,null,null,null,null,null,null,null,null,null,null,null,null,null,null,"","","",null,null,"RODNE_CISLO","","",null,null,null,null,null,null,"","",null,null,"",null,"",null,null,null,""]
[{"$f":"evidence!A232","v":0},{"$f":"IF(ISTEXT(evidence!B232),evidence!B232,\"\")","v":""},{"$f":"evidence!C232","v":0},{"$f":"evidence!D232","v":0},1918,{"$f":"evidence!E232","v":0},{"$f":"evidence!L232","v":0},{"$f":"evidence!M232","v":0},{"$f":"evidence!N232","v":0},{"$f":"evidence!O232","v":0},{"$f":"evidence!P232","v":0},0,0,0,{"$f":"evidence!Q232","v":"00:00:00"},1900,2016,0,{"$f":"evidence!S232","v":0},"",null,{"$f":"evidence!F232","v":0},{"$f":"evidence!K232","v":0},null,null,null,0,0,0,0,0,0,0,0,0,0,0,0,0,0,0,0,0,0,0,0,0,null,null,null,null,null,0,0,0,0,0,"RODNE_CISLO",0,0,null,null,null,0,0,0,0,"","",0,0,0,0,0,0,null,null,null,null,null,null,null,null,null,null,null,null,null,null,null,null,null,null,null,null,null,null,null,null,null,null,null,null,null,"","","",null,null,"RODNE_CISLO","","",null,null,null,null,null,null,"","",null,null,"",null,"",null,null,null,""]
[{"$f":"evidence!A233","v":0},{"$f":"IF(ISTEXT(evidence!B233),evidence!B233,\"\")","v":""},{"$f":"evidence!C233","v":0},{"$f":"evidence!D233","v":0},1918,{"$f":"evidence!E233","v":0},{"$f":"evidence!L233","v":0},{"$f":"evidence!M233","v":0},{"$f":"evidence!N233","v":0},{"$f":"evidence!O233","v":0},{"$f":"evidence!P233","v":0},0,0,0,{"$f":"evidence!Q233","v":"00:00:00"},1900,2016,0,{"$f":"evidence!S233","v":0},"",null,{"$f":"evidence!F233","v":0},{"$f":"evidence!K233","v":0},null,null,null,0,0,0,0,0,0,0,0,0,0,0,0,0,0,0,0,0,0,0,0,0,null,null,null,null,null,0,0,0,0,0,"RODNE_CISLO",0,0,null,null,null,0,0,0,0,"","",0,0,0,0,0,0,null,null,null,null,null,null,null,null,null,null,null,null,null,null,null,null,null,null,null,null,null,null,null,null,null,null,null,null,null,"","","",null,null,"RODNE_CISLO","","",null,null,null,null,null,null,"","",null,null,"",null,"",null,null,null,""]
[{"$f":"evidence!A234","v":0},{"$f":"IF(ISTEXT(evidence!B234),evidence!B234,\"\")","v":""},{"$f":"evidence!C234","v":0},{"$f":"evidence!D234","v":0},1918,{"$f":"evidence!E234","v":0},{"$f":"evidence!L234","v":0},{"$f":"evidence!M234","v":0},{"$f":"evidence!N234","v":0},{"$f":"evidence!O234","v":0},{"$f":"evidence!P234","v":0},0,0,0,{"$f":"evidence!Q234","v":"00:00:00"},1900,2016,0,{"$f":"evidence!S234","v":0},"",null,{"$f":"evidence!F234","v":0},{"$f":"evidence!K234","v":0},null,null,null,0,0,0,0,0,0,0,0,0,0,0,0,0,0,0,0,0,0,0,0,0,null,null,null,null,null,0,0,0,0,0,"RODNE_CISLO",0,0,null,null,null,0,0,0,0,"","",0,0,0,0,0,0,null,null,null,null,null,null,null,null,null,null,null,null,null,null,null,null,null,null,null,null,null,null,null,null,null,null,null,null,null,"","","",null,null,"RODNE_CISLO","","",null,null,null,null,null,null,"","",null,null,"",null,"",null,null,null,""]
[{"$f":"evidence!A235","v":0},{"$f":"IF(ISTEXT(evidence!B235),evidence!B235,\"\")","v":""},{"$f":"evidence!C235","v":0},{"$f":"evidence!D235","v":0},1918,{"$f":"evidence!E235","v":0},{"$f":"evidence!L235","v":0},{"$f":"evidence!M235","v":0},{"$f":"evidence!N235","v":0},{"$f":"evidence!O235","v":0},{"$f":"evidence!P235","v":0},0,0,0,{"$f":"evidence!Q235","v":"00:00:00"},1900,2016,0,{"$f":"evidence!S235","v":0},"",null,{"$f":"evidence!F235","v":0},{"$f":"evidence!K235","v":0},null,null,null,0,0,0,0,0,0,0,0,0,0,0,0,0,0,0,0,0,0,0,0,0,null,null,null,null,null,0,0,0,0,0,"RODNE_CISLO",0,0,null,null,null,0,0,0,0,"","",0,0,0,0,0,0,null,null,null,null,null,null,null,null,null,null,null,null,null,null,null,null,null,null,null,null,null,null,null,null,null,null,null,null,null,"","","",null,null,"RODNE_CISLO","","",null,null,null,null,null,null,"","",null,null,"",null,"",null,null,null,""]
[{"$f":"evidence!A236","v":0},{"$f":"IF(ISTEXT(evidence!B236),evidence!B236,\"\")","v":""},{"$f":"evidence!C236","v":0},{"$f":"evidence!D236","v":0},1918,{"$f":"evidence!E236","v":0},{"$f":"evidence!L236","v":0},{"$f":"evidence!M236","v":0},{"$f":"evidence!N236","v":0},{"$f":"evidence!O236","v":0},{"$f":"evidence!P236","v":0},0,0,0,{"$f":"evidence!Q236","v":"00:00:00"},1900,2016,0,{"$f":"evidence!S236","v":0},"",null,{"$f":"evidence!F236","v":0},{"$f":"evidence!K236","v":0},null,null,null,0,0,0,0,0,0,0,0,0,0,0,0,0,0,0,0,0,0,0,0,0,null,null,null,null,null,0,0,0,0,0,"RODNE_CISLO",0,0,null,null,null,0,0,0,0,"","",0,0,0,0,0,0,null,null,null,null,null,null,null,null,null,null,null,null,null,null,null,null,null,null,null,null,null,null,null,null,null,null,null,null,null,"","","",null,null,"RODNE_CISLO","","",null,null,null,null,null,null,"","",null,null,"",null,"",null,null,null,""]
[{"$f":"evidence!A237","v":0},{"$f":"IF(ISTEXT(evidence!B237),evidence!B237,\"\")","v":""},{"$f":"evidence!C237","v":0},{"$f":"evidence!D237","v":0},1918,{"$f":"evidence!E237","v":0},{"$f":"evidence!L237","v":0},{"$f":"evidence!M237","v":0},{"$f":"evidence!N237","v":0},{"$f":"evidence!O237","v":0},{"$f":"evidence!P237","v":0},0,0,0,{"$f":"evidence!Q237","v":"00:00:00"},1900,2016,0,{"$f":"evidence!S237","v":0},"",null,{"$f":"evidence!F237","v":0},{"$f":"evidence!K237","v":0},null,null,null,0,0,0,0,0,0,0,0,0,0,0,0,0,0,0,0,0,0,0,0,0,null,null,null,null,null,0,0,0,0,0,"RODNE_CISLO",0,0,null,null,null,0,0,0,0,"","",0,0,0,0,0,0,null,null,null,null,null,null,null,null,null,null,null,null,null,null,null,null,null,null,null,null,null,null,null,null,null,null,null,null,null,"","","",null,null,"RODNE_CISLO","","",null,null,null,null,null,null,"","",null,null,"",null,"",null,null,null,""]
[{"$f":"evidence!A238","v":0},{"$f":"IF(ISTEXT(evidence!B238),evidence!B238,\"\")","v":""},{"$f":"evidence!C238","v":0},{"$f":"evidence!D238","v":0},1918,{"$f":"evidence!E238","v":0},{"$f":"evidence!L238","v":0},{"$f":"evidence!M238","v":0},{"$f":"evidence!N238","v":0},{"$f":"evidence!O238","v":0},{"$f":"evidence!P238","v":0},0,0,0,{"$f":"evidence!Q238","v":"00:00:00"},1900,2016,0,{"$f":"evidence!S238","v":0},"",null,{"$f":"evidence!F238","v":0},{"$f":"evidence!K238","v":0},null,null,null,0,0,0,0,0,0,0,0,0,0,0,0,0,0,0,0,0,0,0,0,0,null,null,null,null,null,0,0,0,0,0,"RODNE_CISLO",0,0,null,null,null,0,0,0,0,"","",0,0,0,0,0,0,null,null,null,null,null,null,null,null,null,null,null,null,null,null,null,null,null,null,null,null,null,null,null,null,null,null,null,null,null,"","","",null,null,"RODNE_CISLO","","",null,null,null,null,null,null,"","",null,null,"",null,"",null,null,null,""]
[{"$f":"evidence!A239","v":0},{"$f":"IF(ISTEXT(evidence!B239),evidence!B239,\"\")","v":""},{"$f":"evidence!C239","v":0},{"$f":"evidence!D239","v":0},1918,{"$f":"evidence!E239","v":0},{"$f":"evidence!L239","v":0},{"$f":"evidence!M239","v":0},{"$f":"evidence!N239","v":0},{"$f":"evidence!O239","v":0},{"$f":"evidence!P239","v":0},0,0,0,{"$f":"evidence!Q239","v":"00:00:00"},1900,2016,0,{"$f":"evidence!S239","v":0},"",null,{"$f":"evidence!F239","v":0},{"$f":"evidence!K239","v":0},null,null,null,0,0,0,0,0,0,0,0,0,0,0,0,0,0,0,0,0,0,0,0,0,null,null,null,null,null,0,0,0,0,0,"RODNE_CISLO",0,0,null,null,null,0,0,0,0,"","",0,0,0,0,0,0,null,null,null,null,null,null,null,null,null,null,null,null,null,null,null,null,null,null,null,null,null,null,null,null,null,null,null,null,null,"","","",null,null,"RODNE_CISLO","","",null,null,null,null,null,null,"","",null,null,"",null,"",null,null,null,""]
[{"$f":"evidence!A240","v":0},{"$f":"IF(ISTEXT(evidence!B240),evidence!B240,\"\")","v":""},{"$f":"evidence!C240","v":0},{"$f":"evidence!D240","v":0},1918,{"$f":"evidence!E240","v":0},{"$f":"evidence!L240","v":0},{"$f":"evidence!M240","v":0},{"$f":"evidence!N240","v":0},{"$f":"evidence!O240","v":0},{"$f":"evidence!P240","v":0},0,0,0,{"$f":"evidence!Q240","v":"00:00:00"},1900,2016,0,{"$f":"evidence!S240","v":0},"",null,{"$f":"evidence!F240","v":0},{"$f":"evidence!K240","v":0},null,null,null,0,0,0,0,0,0,0,0,0,0,0,0,0,0,0,0,0,0,0,0,0,null,null,null,null,null,0,0,0,0,0,"RODNE_CISLO",0,0,null,null,null,0,0,0,0,"","",0,0,0,0,0,0,null,null,null,null,null,null,null,null,null,null,null,null,null,null,null,null,null,null,null,null,null,null,null,null,null,null,null,null,null,"","","",null,null,"RODNE_CISLO","","",null,null,null,null,null,null,"","",null,null,"",null,"",null,null,null,""]
[{"$f":"evidence!A241","v":0},{"$f":"IF(ISTEXT(evidence!B241),evidence!B241,\"\")","v":""},{"$f":"evidence!C241","v":0},{"$f":"evidence!D241","v":0},1918,{"$f":"evidence!E241","v":0},{"$f":"evidence!L241","v":0},{"$f":"evidence!M241","v":0},{"$f":"evidence!N241","v":0},{"$f":"evidence!O241","v":0},{"$f":"evidence!P241","v":0},0,0,0,{"$f":"evidence!Q241","v":"00:00:00"},1900,2016,0,{"$f":"evidence!S241","v":0},"",null,{"$f":"evidence!F241","v":0},{"$f":"evidence!K241","v":0},null,null,null,0,0,0,0,0,0,0,0,0,0,0,0,0,0,0,0,0,0,0,0,0,null,null,null,null,null,0,0,0,0,0,"RODNE_CISLO",0,0,null,null,null,0,0,0,0,"","",0,0,0,0,0,0,null,null,null,null,null,null,null,null,null,null,null,null,null,null,null,null,null,null,null,null,null,null,null,null,null,null,null,null,null,"","","",null,null,"RODNE_CISLO","","",null,null,null,null,null,null,"","",null,null,"",null,"",null,null,null,""]
[{"$f":"evidence!A242","v":0},{"$f":"IF(ISTEXT(evidence!B242),evidence!B242,\"\")","v":""},{"$f":"evidence!C242","v":0},{"$f":"evidence!D242","v":0},1918,{"$f":"evidence!E242","v":0},{"$f":"evidence!L242","v":0},{"$f":"evidence!M242","v":0},{"$f":"evidence!N242","v":0},{"$f":"evidence!O242","v":0},{"$f":"evidence!P242","v":0},0,0,0,{"$f":"evidence!Q242","v":"00:00:00"},1900,2016,0,{"$f":"evidence!S242","v":0},"",null,{"$f":"evidence!F242","v":0},{"$f":"evidence!K242","v":0},null,null,null,0,0,0,0,0,0,0,0,0,0,0,0,0,0,0,0,0,0,0,0,0,null,null,null,null,null,0,0,0,0,0,"RODNE_CISLO",0,0,null,null,null,0,0,0,0,"","",0,0,0,0,0,0,null,null,null,null,null,null,null,null,null,null,null,null,null,null,null,null,null,null,null,null,null,null,null,null,null,null,null,null,null,"","","",null,null,"RODNE_CISLO","","",null,null,null,null,null,null,"","",null,null,"",null,"",null,null,null,""]
[{"$f":"evidence!A243","v":0},{"$f":"IF(ISTEXT(evidence!B243),evidence!B243,\"\")","v":""},{"$f":"evidence!C243","v":0},{"$f":"evidence!D243","v":0},1918,{"$f":"evidence!E243","v":0},{"$f":"evidence!L243","v":0},{"$f":"evidence!M243","v":0},{"$f":"evidence!N243","v":0},{"$f":"evidence!O243","v":0},{"$f":"evidence!P243","v":0},0,0,0,{"$f":"evidence!Q243","v":"00:00:00"},1900,2016,0,{"$f":"evidence!S243","v":0},"",null,{"$f":"evidence!F243","v":0},{"$f":"evidence!K243","v":0},null,null,null,0,0,0,0,0,0,0,0,0,0,0,0,0,0,0,0,0,0,0,0,0,null,null,null,null,null,0,0,0,0,0,"RODNE_CISLO",0,0,null,null,null,0,0,0,0,"","",0,0,0,0,0,0,null,null,null,null,null,null,null,null,null,null,null,null,null,null,null,null,null,null,null,null,null,null,null,null,null,null,null,null,null,"","","",null,null,"RODNE_CISLO","","",null,null,null,null,null,null,"","",null,null,"",null,"",null,null,null,""]
[{"$f":"evidence!A244","v":0},{"$f":"IF(ISTEXT(evidence!B244),evidence!B244,\"\")","v":""},{"$f":"evidence!C244","v":0},{"$f":"evidence!D244","v":0},1918,{"$f":"evidence!E244","v":0},{"$f":"evidence!L244","v":0},{"$f":"evidence!M244","v":0},{"$f":"evidence!N244","v":0},{"$f":"evidence!O244","v":0},{"$f":"evidence!P244","v":0},0,0,0,{"$f":"evidence!Q244","v":"00:00:00"},1900,2016,0,{"$f":"evidence!S244","v":0},"",null,{"$f":"evidence!F244","v":0},{"$f":"evidence!K244","v":0},null,null,null,0,0,0,0,0,0,0,0,0,0,0,0,0,0,0,0,0,0,0,0,0,null,null,null,null,null,0,0,0,0,0,"RODNE_CISLO",0,0,null,null,null,0,0,0,0,"","",0,0,0,0,0,0,null,null,null,null,null,null,null,null,null,null,null,null,null,null,null,null,null,null,null,null,null,null,null,null,null,null,null,null,null,"","","",null,null,"RODNE_CISLO","","",null,null,null,null,null,null,"","",null,null,"",null,"",null,null,null,""]
[{"$f":"evidence!A245","v":0},{"$f":"IF(ISTEXT(evidence!B245),evidence!B245,\"\")","v":""},{"$f":"evidence!C245","v":0},{"$f":"evidence!D245","v":0},1918,{"$f":"evidence!E245","v":0},{"$f":"evidence!L245","v":0},{"$f":"evidence!M245","v":0},{"$f":"evidence!N245","v":0},{"$f":"evidence!O245","v":0},{"$f":"evidence!P245","v":0},0,0,0,{"$f":"evidence!Q245","v":"00:00:00"},1900,2016,0,{"$f":"evidence!S245","v":0},"",null,{"$f":"evidence!F245","v":0},{"$f":"evidence!K245","v":0},null,null,null,0,0,0,0,0,0,0,0,0,0,0,0,0,0,0,0,0,0,0,0,0,null,null,null,null,null,0,0,0,0,0,"RODNE_CISLO",0,0,null,null,null,0,0,0,0,"","",0,0,0,0,0,0,null,null,null,null,null,null,null,null,null,null,null,null,null,null,null,null,null,null,null,null,null,null,null,null,null,null,null,null,null,"","","",null,null,"RODNE_CISLO","","",null,null,null,null,null,null,"","",null,null,"",null,"",null,null,null,""]
[{"$f":"evidence!A246","v":0},{"$f":"IF(ISTEXT(evidence!B246),evidence!B246,\"\")","v":""},{"$f":"evidence!C246","v":0},{"$f":"evidence!D246","v":0},1918,{"$f":"evidence!E246","v":0},{"$f":"evidence!L246","v":0},{"$f":"evidence!M246","v":0},{"$f":"evidence!N246","v":0},{"$f":"evidence!O246","v":0},{"$f":"evidence!P246","v":0},0,0,0,{"$f":"evidence!Q246","v":"00:00:00"},1900,2016,0,{"$f":"evidence!S246","v":0},"",null,{"$f":"evidence!F246","v":0},{"$f":"evidence!K246","v":0},null,null,null,0,0,0,0,0,0,0,0,0,0,0,0,0,0,0,0,0,0,0,0,0,null,null,null,null,null,0,0,0,0,0,"RODNE_CISLO",0,0,null,null,null,0,0,0,0,"","",0,0,0,0,0,0,null,null,null,null,null,null,null,null,null,null,null,null,null,null,null,null,null,null,null,null,null,null,null,null,null,null,null,null,null,"","","",null,null,"RODNE_CISLO","","",null,null,null,null,null,null,"","",null,null,"",null,"",null,null,null,""]
[{"$f":"evidence!A247","v":0},{"$f":"IF(ISTEXT(evidence!B247),evidence!B247,\"\")","v":""},{"$f":"evidence!C247","v":0},{"$f":"evidence!D247","v":0},1918,{"$f":"evidence!E247","v":0},{"$f":"evidence!L247","v":0},{"$f":"evidence!M247","v":0},{"$f":"evidence!N247","v":0},{"$f":"evidence!O247","v":0},{"$f":"evidence!P247","v":0},0,0,0,{"$f":"evidence!Q247","v":"00:00:00"},1900,2016,0,{"$f":"evidence!S247","v":0},"",null,{"$f":"evidence!F247","v":0},{"$f":"evidence!K247","v":0},null,null,null,0,0,0,0,0,0,0,0,0,0,0,0,0,0,0,0,0,0,0,0,0,null,null,null,null,null,0,0,0,0,0,"RODNE_CISLO",0,0,null,null,null,0,0,0,0,"","",0,0,0,0,0,0,null,null,null,null,null,null,null,null,null,null,null,null,null,null,null,null,null,null,null,null,null,null,null,null,null,null,null,null,null,"","","",null,null,"RODNE_CISLO","","",null,null,null,null,null,null,"","",null,null,"",null,"",null,null,null,""]
[{"$f":"evidence!A248","v":0},{"$f":"IF(ISTEXT(evidence!B248),evidence!B248,\"\")","v":""},{"$f":"evidence!C248","v":0},{"$f":"evidence!D248","v":0},1918,{"$f":"evidence!E248","v":0},{"$f":"evidence!L248","v":0},{"$f":"evidence!M248","v":0},{"$f":"evidence!N248","v":0},{"$f":"evidence!O248","v":0},{"$f":"evidence!P248","v":0},0,0,0,{"$f":"evidence!Q248","v":"00:00:00"},1900,2016,0,{"$f":"evidence!S248","v":0},"",null,{"$f":"evidence!F248","v":0},{"$f":"evidence!K248","v":0},null,null,null,0,0,0,0,0,0,0,0,0,0,0,0,0,0,0,0,0,0,0,0,0,null,null,null,null,null,0,0,0,0,0,"RODNE_CISLO",0,0,null,null,null,0,0,0,0,"","",0,0,0,0,0,0,null,null,null,null,null,null,null,null,null,null,null,null,null,null,null,null,null,null,null,null,null,null,null,null,null,null,null,null,null,"","","",null,null,"RODNE_CISLO","","",null,null,null,null,null,null,"","",null,null,"",null,"",null,null,null,""]
[{"$f":"evidence!A249","v":0},{"$f":"IF(ISTEXT(evidence!B249),evidence!B249,\"\")","v":""},{"$f":"evidence!C249","v":0},{"$f":"evidence!D249","v":0},1918,{"$f":"evidence!E249","v":0},{"$f":"evidence!L249","v":0},{"$f":"evidence!M249","v":0},{"$f":"evidence!N249","v":0},{"$f":"evidence!O249","v":0},{"$f":"evidence!P249","v":0},0,0,0,{"$f":"evidence!Q249","v":"00:00:00"},1900,2016,0,{"$f":"evidence!S249","v":0},"",null,{"$f":"evidence!F249","v":0},{"$f":"evidence!K249","v":0},null,null,null,0,0,0,0,0,0,0,0,0,0,0,0,0,0,0,0,0,0,0,0,0,null,null,null,null,null,0,0,0,0,0,"RODNE_CISLO",0,0,null,null,null,0,0,0,0,"","",0,0,0,0,0,0,null,null,null,null,null,null,null,null,null,null,null,null,null,null,null,null,null,null,null,null,null,null,null,null,null,null,null,null,null,"","","",null,null,"RODNE_CISLO","","",null,null,null,null,null,null,"","",null,null,"",null,"",null,null,null,""]
[{"$f":"evidence!A250","v":0},{"$f":"IF(ISTEXT(evidence!B250),evidence!B250,\"\")","v":""},{"$f":"evidence!C250","v":0},{"$f":"evidence!D250","v":0},1918,{"$f":"evidence!E250","v":0},{"$f":"evidence!L250","v":0},{"$f":"evidence!M250","v":0},{"$f":"evidence!N250","v":0},{"$f":"evidence!O250","v":0},{"$f":"evidence!P250","v":0},0,0,0,{"$f":"evidence!Q250","v":"00:00:00"},1900,2016,0,{"$f":"evidence!S250","v":0},"",null,{"$f":"evidence!F250","v":0},{"$f":"evidence!K250","v":0},null,null,null,0,0,0,0,0,0,0,0,0,0,0,0,0,0,0,0,0,0,0,0,0,null,null,null,null,null,0,0,0,0,0,"RODNE_CISLO",0,0,null,null,null,0,0,0,0,"","",0,0,0,0,0,0,null,null,null,null,null,null,null,null,null,null,null,null,null,null,null,null,null,null,null,null,null,null,null,null,null,null,null,null,null,"","","",null,null,"RODNE_CISLO","","",null,null,null,null,null,null,"","",null,null,"",null,"",null,null,null,""]
[{"$f":"evidence!A251","v":0},{"$f":"IF(ISTEXT(evidence!B251),evidence!B251,\"\")","v":""},{"$f":"evidence!C251","v":0},{"$f":"evidence!D251","v":0},1918,{"$f":"evidence!E251","v":0},{"$f":"evidence!L251","v":0},{"$f":"evidence!M251","v":0},{"$f":"evidence!N251","v":0},{"$f":"evidence!O251","v":0},{"$f":"evidence!P251","v":0},0,0,0,{"$f":"evidence!Q251","v":"00:00:00"},1900,2016,0,{"$f":"evidence!S251","v":0},"",null,{"$f":"evidence!F251","v":0},{"$f":"evidence!K251","v":0},null,null,null,0,0,0,0,0,0,0,0,0,0,0,0,0,0,0,0,0,0,0,0,0,null,null,null,null,null,0,0,0,0,0,"RODNE_CISLO",0,0,null,null,null,0,0,0,0,"","",0,0,0,0,0,0,null,null,null,null,null,null,null,null,null,null,null,null,null,null,null,null,null,null,null,null,null,null,null,null,null,null,null,null,null,"","","",null,null,"RODNE_CISLO","","",null,null,null,null,null,null,"","",null,null,"",null,"",null,null,null,""]
[{"$f":"evidence!A252","v":0},{"$f":"IF(ISTEXT(evidence!B252),evidence!B252,\"\")","v":""},{"$f":"evidence!C252","v":0},{"$f":"evidence!D252","v":0},1918,{"$f":"evidence!E252","v":0},{"$f":"evidence!L252","v":0},{"$f":"evidence!M252","v":0},{"$f":"evidence!N252","v":0},{"$f":"evidence!O252","v":0},{"$f":"evidence!P252","v":0},0,0,0,{"$f":"evidence!Q252","v":"00:00:00"},1900,2016,0,{"$f":"evidence!S252","v":0},"",null,{"$f":"evidence!F252","v":0},{"$f":"evidence!K252","v":0},null,null,null,0,0,0,0,0,0,0,0,0,0,0,0,0,0,0,0,0,0,0,0,0,null,null,null,null,null,0,0,0,0,0,"RODNE_CISLO",0,0,null,null,null,0,0,0,0,"","",0,0,0,0,0,0,null,null,null,null,null,null,null,null,null,null,null,null,null,null,null,null,null,null,null,null,null,null,null,null,null,null,null,null,null,"","","",null,null,"RODNE_CISLO","","",null,null,null,null,null,null,"","",null,null,"",null,"",null,null,null,""]
[{"$f":"evidence!A253","v":0},{"$f":"IF(ISTEXT(evidence!B253),evidence!B253,\"\")","v":""},{"$f":"evidence!C253","v":0},{"$f":"evidence!D253","v":0},1918,{"$f":"evidence!E253","v":0},{"$f":"evidence!L253","v":0},{"$f":"evidence!M253","v":0},{"$f":"evidence!N253","v":0},{"$f":"evidence!O253","v":0},{"$f":"evidence!P253","v":0},0,0,0,{"$f":"evidence!Q253","v":"00:00:00"},1900,2016,0,{"$f":"evidence!S253","v":0},"",null,{"$f":"evidence!F253","v":0},{"$f":"evidence!K253","v":0},null,null,null,0,0,0,0,0,0,0,0,0,0,0,0,0,0,0,0,0,0,0,0,0,null,null,null,null,null,0,0,0,0,0,"RODNE_CISLO",0,0,null,null,null,0,0,0,0,"","",0,0,0,0,0,0,null,null,null,null,null,null,null,null,null,null,null,null,null,null,null,null,null,null,null,null,null,null,null,null,null,null,null,null,null,"","","",null,null,"RODNE_CISLO","","",null,null,null,null,null,null,"","",null,null,"",null,"",null,null,null,""]
[{"$f":"evidence!A254","v":0},{"$f":"IF(ISTEXT(evidence!B254),evidence!B254,\"\")","v":""},{"$f":"evidence!C254","v":0},{"$f":"evidence!D254","v":0},1918,{"$f":"evidence!E254","v":0},{"$f":"evidence!L254","v":0},{"$f":"evidence!M254","v":0},{"$f":"evidence!N254","v":0},{"$f":"evidence!O254","v":0},{"$f":"evidence!P254","v":0},0,0,0,{"$f":"evidence!Q254","v":"00:00:00"},1900,2016,0,{"$f":"evidence!S254","v":0},"",null,{"$f":"evidence!F254","v":0},{"$f":"evidence!K254","v":0},null,null,null,0,0,0,0,0,0,0,0,0,0,0,0,0,0,0,0,0,0,0,0,0,null,null,null,null,null,0,0,0,0,0,"RODNE_CISLO",0,0,null,null,null,0,0,0,0,"","",0,0,0,0,0,0,null,null,null,null,null,null,null,null,null,null,null,null,null,null,null,null,null,null,null,null,null,null,null,null,null,null,null,null,null,"","","",null,null,"RODNE_CISLO","","",null,null,null,null,null,null,"","",null,null,"",null,"",null,null,null,""]
[{"$f":"evidence!A255","v":0},{"$f":"IF(ISTEXT(evidence!B255),evidence!B255,\"\")","v":""},{"$f":"evidence!C255","v":0},{"$f":"evidence!D255","v":0},1918,{"$f":"evidence!E255","v":0},{"$f":"evidence!L255","v":0},{"$f":"evidence!M255","v":0},{"$f":"evidence!N255","v":0},{"$f":"evidence!O255","v":0},{"$f":"evidence!P255","v":0},0,0,0,{"$f":"evidence!Q255","v":"00:00:00"},1900,2016,0,{"$f":"evidence!S255","v":0},"",null,{"$f":"evidence!F255","v":0},{"$f":"evidence!K255","v":0},null,null,null,0,0,0,0,0,0,0,0,0,0,0,0,0,0,0,0,0,0,0,0,0,null,null,null,null,null,0,0,0,0,0,"RODNE_CISLO",0,0,null,null,null,0,0,0,0,"","",0,0,0,0,0,0,null,null,null,null,null,null,null,null,null,null,null,null,null,null,null,null,null,null,null,null,null,null,null,null,null,null,null,null,null,"","","",null,null,"RODNE_CISLO","","",null,null,null,null,null,null,"","",null,null,"",null,"",null,null,null,""]
[{"$f":"evidence!A256","v":0},{"$f":"IF(ISTEXT(evidence!B256),evidence!B256,\"\")","v":""},{"$f":"evidence!C256","v":0},{"$f":"evidence!D256","v":0},1918,{"$f":"evidence!E256","v":0},{"$f":"evidence!L256","v":0},{"$f":"evidence!M256","v":0},{"$f":"evidence!N256","v":0},{"$f":"evidence!O256","v":0},{"$f":"evidence!P256","v":0},0,0,0,{"$f":"evidence!Q256","v":"00:00:00"},1900,2016,0,{"$f":"evidence!S256","v":0},"",null,{"$f":"evidence!F256","v":0},{"$f":"evidence!K256","v":0},null,null,null,0,0,0,0,0,0,0,0,0,0,0,0,0,0,0,0,0,0,0,0,0,null,null,null,null,null,0,0,0,0,0,"RODNE_CISLO",0,0,null,null,null,0,0,0,0,"","",0,0,0,0,0,0,null,null,null,null,null,null,null,null,null,null,null,null,null,null,null,null,null,null,null,null,null,null,null,null,null,null,null,null,null,"","","",null,null,"RODNE_CISLO","","",null,null,null,null,null,null,"","",null,null,"",null,"",null,null,null,""]
[{"$f":"evidence!A257","v":0},{"$f":"IF(ISTEXT(evidence!B257),evidence!B257,\"\")","v":""},{"$f":"evidence!C257","v":0},{"$f":"evidence!D257","v":0},1918,{"$f":"evidence!E257","v":0},{"$f":"evidence!L257","v":0},{"$f":"evidence!M257","v":0},{"$f":"evidence!N257","v":0},{"$f":"evidence!O257","v":0},{"$f":"evidence!P257","v":0},0,0,0,{"$f":"evidence!Q257","v":"00:00:00"},1900,2016,0,{"$f":"evidence!S257","v":0},"",null,{"$f":"evidence!F257","v":0},{"$f":"evidence!K257","v":0},null,null,null,0,0,0,0,0,0,0,0,0,0,0,0,0,0,0,0,0,0,0,0,0,null,null,null,null,null,0,0,0,0,0,"RODNE_CISLO",0,0,null,null,null,0,0,0,0,"","",0,0,0,0,0,0,null,null,null,null,null,null,null,null,null,null,null,null,null,null,null,null,null,null,null,null,null,null,null,null,null,null,null,null,null,"","","",null,null,"RODNE_CISLO","","",null,null,null,null,null,null,"","",null,null,"",null,"",null,null,null,""]
[{"$f":"evidence!A258","v":0},{"$f":"IF(ISTEXT(evidence!B258),evidence!B258,\"\")","v":""},{"$f":"evidence!C258","v":0},{"$f":"evidence!D258","v":0},1918,{"$f":"evidence!E258","v":0},{"$f":"evidence!L258","v":0},{"$f":"evidence!M258","v":0},{"$f":"evidence!N258","v":0},{"$f":"evidence!O258","v":0},{"$f":"evidence!P258","v":0},0,0,0,{"$f":"evidence!Q258","v":"00:00:00"},1900,2016,0,{"$f":"evidence!S258","v":0},"",null,{"$f":"evidence!F258","v":0},{"$f":"evidence!K258","v":0},null,null,null,0,0,0,0,0,0,0,0,0,0,0,0,0,0,0,0,0,0,0,0,0,null,null,null,null,null,0,0,0,0,0,"RODNE_CISLO",0,0,null,null,null,0,0,0,0,"","",0,0,0,0,{"$f":"IF((AN260>0),T260,0)","v":0},{"$f":"IF((AN260>0),AU260,0)","v":0},null,null,null,null,null,null,null,null,null,null,null,null,null,null,null,null,null,null,null,null,null,null,null,null,null,null,null,null,null,"","","",null,null,"RODNE_CISLO","","",null,null,null,null,null,null,"","",null,null,"",null,"",null,null,null,""]
[{"$f":"evidence!A259","v":0},{"$f":"IF(ISTEXT(evidence!B259),evidence!B259,\"\")","v":""},{"$f":"evidence!C259","v":0},{"$f":"evidence!D259","v":0},{"$f":"YEAR(D261)+$E$2","v":1918},{"$f":"evidence!E259","v":0},{"$f":"evidence!L259","v":0},{"$f":"evidence!M259","v":0},{"$f":"evidence!N259","v":0},{"$f":"evidence!O259","v":0},{"$f":"evidence!P259","v":0},{"$f":"IF((I261=\"ano\"),1,IF(OR(J261=\"ano\"),1,0))","v":0},{"$f":"IF((K261=\"ano\"),1,0)","v":0},{"$f":"IF((T261=\"ANO\"),SUM(L261:M261),0)","v":0},{"$f":"evidence!Q259","v":"00:00:00"},{"$f":"YEAR(O261)","v":1900},{"$f":"MAX(E261,P261,$Q$2)","v":2016},{"$f":"IF(ISTEXT(A261),1,0)","v":0},{"$f":"evidence!S259","v":0},{"$f":"IF(LEN(F261)<9,\"\",\"ANO\")","v":""},null,{"$f":"evidence!F259","v":0},{"$f":"evidence!K259","v":0},null,null,null,{"$f":"IF((T261=\"ANO\"),A261,0)","v":0},{"$f":"IF((T261=\"ANO\"),B261,0)","v":0},{"$f":"IF((T261=\"ANO\"),C261,0)","v":0},{"$f":"IF((T261=\"ANO\"),D261,0)","v":0},{"$f":"IF((T261=\"ANO\"),E261,0)","v":0},{"$f":"IF((T261=\"ANO\"),F261,0)","v":0},{"$f":"IF((T261=\"ANO\"),G261,0)","v":0},{"$f":"IF((T261=\"ANO\"),H261,0)","v":0},{"$f":"IF((T261=\"ANO\"),I261,0)","v":0},{"$f":"IF((T261=\"ANO\"),J261,0)","v":0},{"$f":"IF((T261=\"ANO\"),K261,0)","v":0},{"$f":"IF((T261=\"ANO\"),L261,0)","v":0},{"$f":"IF((T261=\"ANO\"),M261,0)","v":0},{"$f":"IF((T261=\"ANO\"),N261,0)","v":0},{"$f":"IF((T261=\"ANO\"),O261,0)","v":0},{"$f":"IF((T261=\"ANO\"),P261,0)","v":0},{"$f":"IF((T261=\"ANO\"),Q261,0)","v":0},{"$f":"IF((T261=\"ANO\"),R261,0)","v":0},{"$f":"IF((T261=\"ANO\"),S261,0)","v":0},{"$f":"IF((T261=\"ANO\"),V261,0)","v":0},{"$f":"IF((T261=\"ANO\"),W261,0)","v":0},null,null,null,null,null,{"$f":"IF((AN261>0),A261,0)","v":0},{"$f":"IF((AN261>0),B261,0)","v":0},{"$f":"IF((AN261>0),C261,0)","v":0},{"$f":"IF((AN261>0),D261,0)","v":0},{"$f":"IF((AN261>0),E261,0)","v":0},{"$f":"IF((AN261>0),F261,\"RODNE_CISLO\")","v":"RODNE_CISLO"},{"$f":"IF((AN261>0),G261,0)","v":0},{"$f":"IF((AN261>0),H261,0)","v":0},null,null,null,{"$f":"IF((AL261>0),L261,0)","v":0},{"$f":"IF((AM261>0),M261,0)","v":0},{"$f":"IF((AN261>0),N261,0)","v":0},{"$f":"IF((AN261>0),O261,0)","v":0},{"$f":"IF((AL261>0),P261,\"\")","v":""},{"$f":"IF((AM261>0),Q261,\"\")","v":""},{"$f":"IF((AN261>0),R261,0)","v":0},{"$f":"IF((AN261>0),S261,0)","v":0},{"$f":"IF((AN261>0),AT261,0)","v":0},{"$f":"IF((AN261>0),AU261,0)","v":0},0,0,null,null,null,null,null,null,null,null,null,null,null,null,null,null,null,null,null,null,null,null,null,null,null,null,null,null,null,null,null,{"$f":"IF(ISTEXT(CA261),CG261,\"\")","v":""},{"$f":"IF(ISTEXT(CA261),CA261,\"\")","v":""},{"$f":"IF(ISTEXT(CA261),CC261,\"\")","v":""},null,null,{"$f":"IF(ISTEXT(CA261),CF261,\"RODNE_CISLO\")","v":"RODNE_CISLO"},{"$f":"IF(ISTEXT(CA261),\"CZE\",\"\")","v":""},{"$f":"IF(ISTEXT(CA261),CD261,\"\")","v":""},null,null,null,null,null,null,{"$f":"IF(ISTEXT(CA261),CL261,\"\")","v":""},{"$f":"IF(ISTEXT(CA261),CO261,\"\")","v":""},null,null,{"$f":"IF(ISTEXT(CA261),$DY$2,\"\")","v":""},null,{"$f":"IF(ISTEXT(CA261),CM261,\"\")","v":""},null,null,null,{"$f":"IF(ISTEXT(CA261),$DY$2,\"\")","v":""}]
[{"$f":"evidence!A260","v":0},{"$f":"IF(ISTEXT(evidence!B260),evidence!B260,\"\")","v":""},{"$f":"evidence!C260","v":0},{"$f":"evidence!D260","v":0},1918,{"$f":"evidence!E260","v":0},{"$f":"evidence!L260","v":0},{"$f":"evidence!M260","v":0},{"$f":"evidence!N260","v":0},{"$f":"evidence!O260","v":0},{"$f":"evidence!P260","v":0},0,0,0,{"$f":"evidence!Q260","v":"00:00:00"},1900,2016,0,{"$f":"evidence!S260","v":0},"",null,{"$f":"evidence!F260","v":0},{"$f":"evidence!K260","v":0},null,null,null,0,0,0,0,0,0,0,0,0,0,0,0,0,0,0,0,0,0,0,0,0,null,null,null,null,null,0,0,0,0,0,"RODNE_CISLO",0,0,null,null,null,0,0,0,0,"","",0,0,0,0,0,0,null,null,null,null,null,null,null,null,null,null,null,null,null,null,null,null,null,null,null,null,null,null,null,null,null,null,null,null,null,"","","",null,null,"RODNE_CISLO","","",null,null,null,null,null,null,"","",null,null,"",null,"",null,null,null,""]
[{"$f":"evidence!A261","v":0},{"$f":"IF(ISTEXT(evidence!B261),evidence!B261,\"\")","v":""},{"$f":"evidence!C261","v":0},{"$f":"evidence!D261","v":0},1918,{"$f":"evidence!E261","v":0},{"$f":"evidence!L261","v":0},{"$f":"evidence!M261","v":0},{"$f":"evidence!N261","v":0},{"$f":"evidence!O261","v":0},{"$f":"evidence!P261","v":0},0,0,0,{"$f":"evidence!Q261","v":"00:00:00"},1900,2016,0,{"$f":"evidence!S261","v":0},"",null,{"$f":"evidence!F261","v":0},{"$f":"evidence!K261","v":0},null,null,null,0,0,0,0,0,0,0,0,0,0,0,0,0,0,0,0,0,0,0,0,0,null,null,null,null,null,0,0,0,0,0,"RODNE_CISLO",0,0,null,null,null,0,0,0,0,"","",0,0,0,0,0,0,null,null,null,null,null,null,null,null,null,null,null,null,null,null,null,null,null,null,null,null,null,null,null,null,null,null,null,null,null,"","","",null,null,"RODNE_CISLO","","",null,null,null,null,null,null,"","",null,null,"",null,"",null,null,null,""]
[{"$f":"evidence!A262","v":0},{"$f":"IF(ISTEXT(evidence!B262),evidence!B262,\"\")","v":""},{"$f":"evidence!C262","v":0},{"$f":"evidence!D262","v":0},1918,{"$f":"evidence!E262","v":0},{"$f":"evidence!L262","v":0},{"$f":"evidence!M262","v":0},{"$f":"evidence!N262","v":0},{"$f":"evidence!O262","v":0},{"$f":"evidence!P262","v":0},0,0,0,{"$f":"evidence!Q262","v":"00:00:00"},1900,2016,0,{"$f":"evidence!S262","v":0},"",null,{"$f":"evidence!F262","v":0},{"$f":"evidence!K262","v":0},null,null,null,0,0,0,0,0,0,0,0,0,0,0,0,0,0,0,0,0,0,0,0,0,null,null,null,null,null,0,0,0,0,0,"RODNE_CISLO",0,0,null,null,null,0,0,0,0,"","",0,0,0,0,0,0,null,null,null,null,null,null,null,null,null,null,null,null,null,null,null,null,null,null,null,null,null,null,null,null,null,null,null,null,null,"","","",null,null,"RODNE_CISLO","","",null,null,null,null,null,null,"","",null,null,"",null,"",null,null,null,""]
[{"$f":"evidence!A263","v":0},{"$f":"IF(ISTEXT(evidence!B263),evidence!B263,\"\")","v":""},{"$f":"evidence!C263","v":0},{"$f":"evidence!D263","v":0},1918,{"$f":"evidence!E263","v":0},{"$f":"evidence!L263","v":0},{"$f":"evidence!M263","v":0},{"$f":"evidence!N263","v":0},{"$f":"evidence!O263","v":0},{"$f":"evidence!P263","v":0},0,0,0,{"$f":"evidence!Q263","v":"00:00:00"},1900,2016,0,{"$f":"evidence!S263","v":0},"",null,{"$f":"evidence!F263","v":0},{"$f":"evidence!K263","v":0},null,null,null,0,0,0,0,0,0,0,0,0,0,0,0,0,0,0,0,0,0,0,0,0,null,null,null,null,null,0,0,0,0,0,"RODNE_CISLO",0,0,null,null,null,0,0,0,0,"","",0,0,0,0,0,0,null,null,null,null,null,null,null,null,null,null,null,null,null,null,null,null,null,null,null,null,null,null,null,null,null,null,null,null,null,"","","",null,null,"RODNE_CISLO","","",null,null,null,null,null,null,"","",null,null,"",null,"",null,null,null,""]
[{"$f":"evidence!A264","v":0},{"$f":"IF(ISTEXT(evidence!B264),evidence!B264,\"\")","v":""},{"$f":"evidence!C264","v":0},{"$f":"evidence!D264","v":0},1918,{"$f":"evidence!E264","v":0},{"$f":"evidence!L264","v":0},{"$f":"evidence!M264","v":0},{"$f":"evidence!N264","v":0},{"$f":"evidence!O264","v":0},{"$f":"evidence!P264","v":0},0,0,0,{"$f":"evidence!Q264","v":"00:00:00"},1900,2016,0,{"$f":"evidence!S264","v":0},"",null,{"$f":"evidence!F264","v":0},{"$f":"evidence!K264","v":0},null,null,null,0,0,0,0,0,0,0,0,0,0,0,0,0,0,0,0,0,0,0,0,0,null,null,null,null,null,0,0,0,0,0,"RODNE_CISLO",0,0,null,null,null,0,0,0,0,"","",0,0,0,0,0,0,null,null,null,null,null,null,null,null,null,null,null,null,null,null,null,null,null,null,null,null,null,null,null,null,null,null,null,null,null,"","","",null,null,"RODNE_CISLO","","",null,null,null,null,null,null,"","",null,null,"",null,"",null,null,null,""]
[{"$f":"evidence!A265","v":0},{"$f":"IF(ISTEXT(evidence!B265),evidence!B265,\"\")","v":""},{"$f":"evidence!C265","v":0},{"$f":"evidence!D265","v":0},1918,{"$f":"evidence!E265","v":0},{"$f":"evidence!L265","v":0},{"$f":"evidence!M265","v":0},{"$f":"evidence!N265","v":0},{"$f":"evidence!O265","v":0},{"$f":"evidence!P265","v":0},0,0,0,{"$f":"evidence!Q265","v":"00:00:00"},1900,2016,0,{"$f":"evidence!S265","v":0},"",null,{"$f":"evidence!F265","v":0},{"$f":"evidence!K265","v":0},null,null,null,0,0,0,0,0,0,0,0,0,0,0,0,0,0,0,0,0,0,0,0,0,null,null,null,null,null,0,0,0,0,0,"RODNE_CISLO",0,0,null,null,null,0,0,0,0,"","",0,0,0,0,0,0,null,null,null,null,null,null,null,null,null,null,null,null,null,null,null,null,null,null,null,null,null,null,null,null,null,null,null,null,null,"","","",null,null,"RODNE_CISLO","","",null,null,null,null,null,null,"","",null,null,"",null,"",null,null,null,""]
[{"$f":"evidence!A266","v":0},{"$f":"IF(ISTEXT(evidence!B266),evidence!B266,\"\")","v":""},{"$f":"evidence!C266","v":0},{"$f":"evidence!D266","v":0},1918,{"$f":"evidence!E266","v":0},{"$f":"evidence!L266","v":0},{"$f":"evidence!M266","v":0},{"$f":"evidence!N266","v":0},{"$f":"evidence!O266","v":0},{"$f":"evidence!P266","v":0},0,0,0,{"$f":"evidence!Q266","v":"00:00:00"},1900,2016,0,{"$f":"evidence!S266","v":0},"",null,{"$f":"evidence!F266","v":0},{"$f":"evidence!K266","v":0},null,null,null,0,0,0,0,0,0,0,0,0,0,0,0,0,0,0,0,0,0,0,0,0,null,null,null,null,null,0,0,0,0,0,"RODNE_CISLO",0,0,null,null,null,0,0,0,0,"","",0,0,0,0,0,0,null,null,null,null,null,null,null,null,null,null,null,null,null,null,null,null,null,null,null,null,null,null,null,null,null,null,null,null,null,"","","",null,null,"RODNE_CISLO","","",null,null,null,null,null,null,"","",null,null,"",null,"",null,null,null,""]
[{"$f":"evidence!A267","v":0},{"$f":"IF(ISTEXT(evidence!B267),evidence!B267,\"\")","v":""},{"$f":"evidence!C267","v":0},{"$f":"evidence!D267","v":0},1918,{"$f":"evidence!E267","v":0},{"$f":"evidence!L267","v":0},{"$f":"evidence!M267","v":0},{"$f":"evidence!N267","v":0},{"$f":"evidence!O267","v":0},{"$f":"evidence!P267","v":0},0,0,0,{"$f":"evidence!Q267","v":"00:00:00"},1900,2016,0,{"$f":"evidence!S267","v":0},"",null,{"$f":"evidence!F267","v":0},{"$f":"evidence!K267","v":0},null,null,null,0,0,0,0,0,0,0,0,0,0,0,0,0,0,0,0,0,0,0,0,0,null,null,null,null,null,0,0,0,0,0,"RODNE_CISLO",0,0,null,null,null,0,0,0,0,"","",0,0,0,0,0,0,null,null,null,null,null,null,null,null,null,null,null,null,null,null,null,null,null,null,null,null,null,null,null,null,null,null,null,null,null,"","","",null,null,"RODNE_CISLO","","",null,null,null,null,null,null,"","",null,null,"",null,"",null,null,null,""]
[{"$f":"evidence!A268","v":0},{"$f":"IF(ISTEXT(evidence!B268),evidence!B268,\"\")","v":""},{"$f":"evidence!C268","v":0},{"$f":"evidence!D268","v":0},1918,{"$f":"evidence!E268","v":0},{"$f":"evidence!L268","v":0},{"$f":"evidence!M268","v":0},{"$f":"evidence!N268","v":0},{"$f":"evidence!O268","v":0},{"$f":"evidence!P268","v":0},0,0,0,{"$f":"evidence!Q268","v":"00:00:00"},1900,2016,0,{"$f":"evidence!S268","v":0},"",null,{"$f":"evidence!F268","v":0},{"$f":"evidence!K268","v":0},null,null,null,0,0,0,0,0,0,0,0,0,0,0,0,0,0,0,0,0,0,0,0,0,null,null,null,null,null,0,0,0,0,0,"RODNE_CISLO",0,0,null,null,null,0,0,0,0,"","",0,0,0,0,0,0,null,null,null,null,null,null,null,null,null,null,null,null,null,null,null,null,null,null,null,null,null,null,null,null,null,null,null,null,null,"","","",null,null,"RODNE_CISLO","","",null,null,null,null,null,null,"","",null,null,"",null,"",null,null,null,""]
[{"$f":"evidence!A269","v":0},{"$f":"IF(ISTEXT(evidence!B269),evidence!B269,\"\")","v":""},{"$f":"evidence!C269","v":0},{"$f":"evidence!D269","v":0},1918,{"$f":"evidence!E269","v":0},{"$f":"evidence!L269","v":0},{"$f":"evidence!M269","v":0},{"$f":"evidence!N269","v":0},{"$f":"evidence!O269","v":0},{"$f":"evidence!P269","v":0},0,0,0,{"$f":"evidence!Q269","v":"00:00:00"},1900,2016,0,{"$f":"evidence!S269","v":0},"",null,{"$f":"evidence!F269","v":0},{"$f":"evidence!K269","v":0},null,null,null,0,0,0,0,0,0,0,0,0,0,0,0,0,0,0,0,0,0,0,0,0,null,null,null,null,null,0,0,0,0,0,"RODNE_CISLO",0,0,null,null,null,0,0,0,0,"","",0,0,0,0,0,0,null,null,null,null,null,null,null,null,null,null,null,null,null,null,null,null,null,null,null,null,null,null,null,null,null,null,null,null,null,"","","",null,null,"RODNE_CISLO","","",null,null,null,null,null,null,"","",null,null,"",null,"",null,null,null,""]
[{"$f":"evidence!A270","v":0},{"$f":"IF(ISTEXT(evidence!B270),evidence!B270,\"\")","v":""},{"$f":"evidence!C270","v":0},{"$f":"evidence!D270","v":0},1918,{"$f":"evidence!E270","v":0},{"$f":"evidence!L270","v":0},{"$f":"evidence!M270","v":0},{"$f":"evidence!N270","v":0},{"$f":"evidence!O270","v":0},{"$f":"evidence!P270","v":0},0,0,0,{"$f":"evidence!Q270","v":"00:00:00"},1900,2016,0,{"$f":"evidence!S270","v":0},"",null,{"$f":"evidence!F270","v":0},{"$f":"evidence!K270","v":0},null,null,null,0,0,0,0,0,0,0,0,0,0,0,0,0,0,0,0,0,0,0,0,0,null,null,null,null,null,0,0,0,0,0,"RODNE_CISLO",0,0,null,null,null,0,0,0,0,"","",0,0,0,0,0,0,null,null,null,null,null,null,null,null,null,null,null,null,null,null,null,null,null,null,null,null,null,null,null,null,null,null,null,null,null,"","","",null,null,"RODNE_CISLO","","",null,null,null,null,null,null,"","",null,null,"",null,"",null,null,null,""]
[{"$f":"evidence!A271","v":0},{"$f":"IF(ISTEXT(evidence!B271),evidence!B271,\"\")","v":""},{"$f":"evidence!C271","v":0},{"$f":"evidence!D271","v":0},1918,{"$f":"evidence!E271","v":0},{"$f":"evidence!L271","v":0},{"$f":"evidence!M271","v":0},{"$f":"evidence!N271","v":0},{"$f":"evidence!O271","v":0},{"$f":"evidence!P271","v":0},0,0,0,{"$f":"evidence!Q271","v":"00:00:00"},1900,2016,0,{"$f":"evidence!S271","v":0},"",null,{"$f":"evidence!F271","v":0},{"$f":"evidence!K271","v":0},null,null,null,0,0,0,0,0,0,0,0,0,0,0,0,0,0,0,0,0,0,0,0,0,null,null,null,null,null,0,0,0,0,0,"RODNE_CISLO",0,0,null,null,null,0,0,0,0,"","",0,0,0,0,0,0,null,null,null,null,null,null,null,null,null,null,null,null,null,null,null,null,null,null,null,null,null,null,null,null,null,null,null,null,null,"","","",null,null,"RODNE_CISLO","","",null,null,null,null,null,null,"","",null,null,"",null,"",null,null,null,""]
[{"$f":"evidence!A272","v":0},{"$f":"IF(ISTEXT(evidence!B272),evidence!B272,\"\")","v":""},{"$f":"evidence!C272","v":0},{"$f":"evidence!D272","v":0},1918,{"$f":"evidence!E272","v":0},{"$f":"evidence!L272","v":0},{"$f":"evidence!M272","v":0},{"$f":"evidence!N272","v":0},{"$f":"evidence!O272","v":0},{"$f":"evidence!P272","v":0},0,0,0,{"$f":"evidence!Q272","v":"00:00:00"},1900,2016,0,{"$f":"evidence!S272","v":0},"",null,{"$f":"evidence!F272","v":0},{"$f":"evidence!K272","v":0},null,null,null,0,0,0,0,0,0,0,0,0,0,0,0,0,0,0,0,0,0,0,0,0,null,null,null,null,null,0,0,0,0,0,"RODNE_CISLO",0,0,null,null,null,0,0,0,0,"","",0,0,0,0,0,0,null,null,null,null,null,null,null,null,null,null,null,null,null,null,null,null,null,null,null,null,null,null,null,null,null,null,null,null,null,"","","",null,null,"RODNE_CISLO","","",null,null,null,null,null,null,"","",null,null,"",null,"",null,null,null,""]
[{"$f":"evidence!A273","v":0},{"$f":"IF(ISTEXT(evidence!B273),evidence!B273,\"\")","v":""},{"$f":"evidence!C273","v":0},{"$f":"evidence!D273","v":0},1918,{"$f":"evidence!E273","v":0},{"$f":"evidence!L273","v":0},{"$f":"evidence!M273","v":0},{"$f":"evidence!N273","v":0},{"$f":"evidence!O273","v":0},{"$f":"evidence!P273","v":0},0,0,0,{"$f":"evidence!Q273","v":"00:00:00"},1900,2016,0,{"$f":"evidence!S273","v":0},"",null,{"$f":"evidence!F273","v":0},{"$f":"evidence!K273","v":0},null,null,null,0,0,0,0,0,0,0,0,0,0,0,0,0,0,0,0,0,0,0,0,0,null,null,null,null,null,0,0,0,0,0,"RODNE_CISLO",0,0,null,null,null,0,0,0,0,"","",0,0,0,0,0,0,null,null,null,null,null,null,null,null,null,null,null,null,null,null,null,null,null,null,null,null,null,null,null,null,null,null,null,null,null,"","","",null,null,"RODNE_CISLO","","",null,null,null,null,null,null,"","",null,null,"",null,"",null,null,null,""]
[{"$f":"evidence!A274","v":0},{"$f":"IF(ISTEXT(evidence!B274),evidence!B274,\"\")","v":""},{"$f":"evidence!C274","v":0},{"$f":"evidence!D274","v":0},1918,{"$f":"evidence!E274","v":0},{"$f":"evidence!L274","v":0},{"$f":"evidence!M274","v":0},{"$f":"evidence!N274","v":0},{"$f":"evidence!O274","v":0},{"$f":"evidence!P274","v":0},0,0,0,{"$f":"evidence!Q274","v":"00:00:00"},1900,2016,0,{"$f":"evidence!S274","v":0},"",null,{"$f":"evidence!F274","v":0},{"$f":"evidence!K274","v":0},null,null,null,0,0,0,0,0,0,0,0,0,0,0,0,0,0,0,0,0,0,0,0,0,null,null,null,null,null,0,0,0,0,0,"RODNE_CISLO",0,0,null,null,null,0,0,0,0,"","",0,0,0,0,0,0,null,null,null,null,null,null,null,null,null,null,null,null,null,null,null,null,null,null,null,null,null,null,null,null,null,null,null,null,null,"","","",null,null,"RODNE_CISLO","","",null,null,null,null,null,null,"","",null,null,"",null,"",null,null,null,""]
[{"$f":"evidence!A275","v":0},{"$f":"IF(ISTEXT(evidence!B275),evidence!B275,\"\")","v":""},{"$f":"evidence!C275","v":0},{"$f":"evidence!D275","v":0},1918,{"$f":"evidence!E275","v":0},{"$f":"evidence!L275","v":0},{"$f":"evidence!M275","v":0},{"$f":"evidence!N275","v":0},{"$f":"evidence!O275","v":0},{"$f":"evidence!P275","v":0},0,0,0,{"$f":"evidence!Q275","v":"00:00:00"},1900,2016,0,{"$f":"evidence!S275","v":0},"",null,{"$f":"evidence!F275","v":0},{"$f":"evidence!K275","v":0},null,null,null,0,0,0,0,0,0,0,0,0,0,0,0,0,0,0,0,0,0,0,0,0,null,null,null,null,null,0,0,0,0,0,"RODNE_CISLO",0,0,null,null,null,0,0,0,0,"","",0,0,0,0,0,0,null,null,null,null,null,null,null,null,null,null,null,null,null,null,null,null,null,null,null,null,null,null,null,null,null,null,null,null,null,"","","",null,null,"RODNE_CISLO","","",null,null,null,null,null,null,"","",null,null,"",null,"",null,null,null,""]
[{"$f":"evidence!A276","v":0},{"$f":"IF(ISTEXT(evidence!B276),evidence!B276,\"\")","v":""},{"$f":"evidence!C276","v":0},{"$f":"evidence!D276","v":0},1918,{"$f":"evidence!E276","v":0},{"$f":"evidence!L276","v":0},{"$f":"evidence!M276","v":0},{"$f":"evidence!N276","v":0},{"$f":"evidence!O276","v":0},{"$f":"evidence!P276","v":0},0,0,0,{"$f":"evidence!Q276","v":"00:00:00"},1900,2016,0,{"$f":"evidence!S276","v":0},"",null,{"$f":"evidence!F276","v":0},{"$f":"evidence!K276","v":0},null,null,null,0,0,0,0,0,0,0,0,0,0,0,0,0,0,0,0,0,0,0,0,0,null,null,null,null,null,0,0,0,0,0,"RODNE_CISLO",0,0,null,null,null,0,0,0,0,"","",0,0,0,0,0,0,null,null,null,null,null,null,null,null,null,null,null,null,null,null,null,null,null,null,null,null,null,null,null,null,null,null,null,null,null,"","","",null,null,"RODNE_CISLO","","",null,null,null,null,null,null,"","",null,null,"",null,"",null,null,null,""]
[{"$f":"evidence!A277","v":0},{"$f":"IF(ISTEXT(evidence!B277),evidence!B277,\"\")","v":""},{"$f":"evidence!C277","v":0},{"$f":"evidence!D277","v":0},1918,{"$f":"evidence!E277","v":0},{"$f":"evidence!L277","v":0},{"$f":"evidence!M277","v":0},{"$f":"evidence!N277","v":0},{"$f":"evidence!O277","v":0},{"$f":"evidence!P277","v":0},0,0,0,{"$f":"evidence!Q277","v":"00:00:00"},1900,2016,0,{"$f":"evidence!S277","v":0},"",null,{"$f":"evidence!F277","v":0},{"$f":"evidence!K277","v":0},null,null,null,0,0,0,0,0,0,0,0,0,0,0,0,0,0,0,0,0,0,0,0,0,null,null,null,null,null,0,0,0,0,0,"RODNE_CISLO",0,0,null,null,null,0,0,0,0,"","",0,0,0,0,0,0,null,null,null,null,null,null,null,null,null,null,null,null,null,null,null,null,null,null,null,null,null,null,null,null,null,null,null,null,null,"","","",null,null,"RODNE_CISLO","","",null,null,null,null,null,null,"","",null,null,"",null,"",null,null,null,""]
[{"$f":"evidence!A278","v":0},{"$f":"IF(ISTEXT(evidence!B278),evidence!B278,\"\")","v":""},{"$f":"evidence!C278","v":0},{"$f":"evidence!D278","v":0},1918,{"$f":"evidence!E278","v":0},{"$f":"evidence!L278","v":0},{"$f":"evidence!M278","v":0},{"$f":"evidence!N278","v":0},{"$f":"evidence!O278","v":0},{"$f":"evidence!P278","v":0},0,0,0,{"$f":"evidence!Q278","v":"00:00:00"},1900,2016,0,{"$f":"evidence!S278","v":0},"",null,{"$f":"evidence!F278","v":0},{"$f":"evidence!K278","v":0},null,null,null,0,0,0,0,0,0,0,0,0,0,0,0,0,0,0,0,0,0,0,0,0,null,null,null,null,null,0,0,0,0,0,"RODNE_CISLO",0,0,null,null,null,0,0,0,0,"","",0,0,0,0,0,0,null,null,null,null,null,null,null,null,null,null,null,null,null,null,null,null,null,null,null,null,null,null,null,null,null,null,null,null,null,"","","",null,null,"RODNE_CISLO","","",null,null,null,null,null,null,"","",null,null,"",null,"",null,null,null,""]
[{"$f":"evidence!A279","v":0},{"$f":"IF(ISTEXT(evidence!B279),evidence!B279,\"\")","v":""},{"$f":"evidence!C279","v":0},{"$f":"evidence!D279","v":0},1918,{"$f":"evidence!E279","v":0},{"$f":"evidence!L279","v":0},{"$f":"evidence!M279","v":0},{"$f":"evidence!N279","v":0},{"$f":"evidence!O279","v":0},{"$f":"evidence!P279","v":0},0,0,0,{"$f":"evidence!Q279","v":"00:00:00"},1900,2016,0,{"$f":"evidence!S279","v":0},"",null,{"$f":"evidence!F279","v":0},{"$f":"evidence!K279","v":0},null,null,null,0,0,0,0,0,0,0,0,0,0,0,0,0,0,0,0,0,0,0,0,0,null,null,null,null,null,0,0,0,0,0,"RODNE_CISLO",0,0,null,null,null,0,0,0,0,"","",0,0,0,0,0,0,null,null,null,null,null,null,null,null,null,null,null,null,null,null,null,null,null,null,null,null,null,null,null,null,null,null,null,null,null,"","","",null,null,"RODNE_CISLO","","",null,null,null,null,null,null,"","",null,null,"",null,"",null,null,null,""]
[{"$f":"evidence!A280","v":0},{"$f":"IF(ISTEXT(evidence!B280),evidence!B280,\"\")","v":""},{"$f":"evidence!C280","v":0},{"$f":"evidence!D280","v":0},1918,{"$f":"evidence!E280","v":0},{"$f":"evidence!L280","v":0},{"$f":"evidence!M280","v":0},{"$f":"evidence!N280","v":0},{"$f":"evidence!O280","v":0},{"$f":"evidence!P280","v":0},0,0,0,{"$f":"evidence!Q280","v":"00:00:00"},1900,2016,0,{"$f":"evidence!S280","v":0},"",null,{"$f":"evidence!F280","v":0},{"$f":"evidence!K280","v":0},null,null,null,0,0,0,0,0,0,0,0,0,0,0,0,0,0,0,0,0,0,0,0,0,null,null,null,null,null,0,0,0,0,0,"RODNE_CISLO",0,0,null,null,null,0,0,0,0,"","",0,0,0,0,0,0,null,null,null,null,null,null,null,null,null,null,null,null,null,null,null,null,null,null,null,null,null,null,null,null,null,null,null,null,null,"","","",null,null,"RODNE_CISLO","","",null,null,null,null,null,null,"","",null,null,"",null,"",null,null,null,""]
[{"$f":"evidence!A281","v":0},{"$f":"IF(ISTEXT(evidence!B281),evidence!B281,\"\")","v":""},{"$f":"evidence!C281","v":0},{"$f":"evidence!D281","v":0},1918,{"$f":"evidence!E281","v":0},{"$f":"evidence!L281","v":0},{"$f":"evidence!M281","v":0},{"$f":"evidence!N281","v":0},{"$f":"evidence!O281","v":0},{"$f":"evidence!P281","v":0},0,0,0,{"$f":"evidence!Q281","v":"00:00:00"},1900,2016,0,{"$f":"evidence!S281","v":0},"",null,{"$f":"evidence!F281","v":0},{"$f":"evidence!K281","v":0},null,null,null,0,0,0,0,0,0,0,0,0,0,0,0,0,0,0,0,0,0,0,0,0,null,null,null,null,null,0,0,0,0,0,"RODNE_CISLO",0,0,null,null,null,0,0,0,0,"","",0,0,0,0,0,0,null,null,null,null,null,null,null,null,null,null,null,null,null,null,null,null,null,null,null,null,null,null,null,null,null,null,null,null,null,"","","",null,null,"RODNE_CISLO","","",null,null,null,null,null,null,"","",null,null,"",null,"",null,null,null,""]
[{"$f":"evidence!A282","v":0},{"$f":"IF(ISTEXT(evidence!B282),evidence!B282,\"\")","v":""},{"$f":"evidence!C282","v":0},{"$f":"evidence!D282","v":0},1918,{"$f":"evidence!E282","v":0},{"$f":"evidence!L282","v":0},{"$f":"evidence!M282","v":0},{"$f":"evidence!N282","v":0},{"$f":"evidence!O282","v":0},{"$f":"evidence!P282","v":0},0,0,0,{"$f":"evidence!Q282","v":"00:00:00"},1900,2016,0,{"$f":"evidence!S282","v":0},"",null,{"$f":"evidence!F282","v":0},{"$f":"evidence!K282","v":0},null,null,null,0,0,0,0,0,0,0,0,0,0,0,0,0,0,0,0,0,0,0,0,0,null,null,null,null,null,0,0,0,0,0,"RODNE_CISLO",0,0,null,null,null,0,0,0,0,"","",0,0,0,0,0,0,null,null,null,null,null,null,null,null,null,null,null,null,null,null,null,null,null,null,null,null,null,null,null,null,null,null,null,null,null,"","","",null,null,"RODNE_CISLO","","",null,null,null,null,null,null,"","",null,null,"",null,"",null,null,null,""]
[{"$f":"evidence!A283","v":0},{"$f":"IF(ISTEXT(evidence!B283),evidence!B283,\"\")","v":""},{"$f":"evidence!C283","v":0},{"$f":"evidence!D283","v":0},1918,{"$f":"evidence!E283","v":0},{"$f":"evidence!L283","v":0},{"$f":"evidence!M283","v":0},{"$f":"evidence!N283","v":0},{"$f":"evidence!O283","v":0},{"$f":"evidence!P283","v":0},0,0,0,{"$f":"evidence!Q283","v":"00:00:00"},1900,2016,0,{"$f":"evidence!S283","v":0},"",null,{"$f":"evidence!F283","v":0},{"$f":"evidence!K283","v":0},null,null,null,0,0,0,0,0,0,0,0,0,0,0,0,0,0,0,0,0,0,0,0,0,null,null,null,null,null,0,0,0,0,0,"RODNE_CISLO",0,0,null,null,null,0,0,0,0,"","",0,0,0,0,0,0,null,null,null,null,null,null,null,null,null,null,null,null,null,null,null,null,null,null,null,null,null,null,null,null,null,null,null,null,null,"","","",null,null,"RODNE_CISLO","","",null,null,null,null,null,null,"","",null,null,"",null,"",null,null,null,""]
[{"$f":"evidence!A284","v":0},{"$f":"IF(ISTEXT(evidence!B284),evidence!B284,\"\")","v":""},{"$f":"evidence!C284","v":0},{"$f":"evidence!D284","v":0},1918,{"$f":"evidence!E284","v":0},{"$f":"evidence!L284","v":0},{"$f":"evidence!M284","v":0},{"$f":"evidence!N284","v":0},{"$f":"evidence!O284","v":0},{"$f":"evidence!P284","v":0},0,0,0,{"$f":"evidence!Q284","v":"00:00:00"},1900,2016,0,{"$f":"evidence!S284","v":0},"",null,{"$f":"evidence!F284","v":0},{"$f":"evidence!K284","v":0},null,null,null,0,0,0,0,0,0,0,0,0,0,0,0,0,0,0,0,0,0,0,0,0,null,null,null,null,null,0,0,0,0,0,"RODNE_CISLO",0,0,null,null,null,0,0,0,0,"","",0,0,0,0,0,0,null,null,null,null,null,null,null,null,null,null,null,null,null,null,null,null,null,null,null,null,null,null,null,null,null,null,null,null,null,"","","",null,null,"RODNE_CISLO","","",null,null,null,null,null,null,"","",null,null,"",null,"",null,null,null,""]
[{"$f":"evidence!A285","v":0},{"$f":"IF(ISTEXT(evidence!B285),evidence!B285,\"\")","v":""},{"$f":"evidence!C285","v":0},{"$f":"evidence!D285","v":0},1918,{"$f":"evidence!E285","v":0},{"$f":"evidence!L285","v":0},{"$f":"evidence!M285","v":0},{"$f":"evidence!N285","v":0},{"$f":"evidence!O285","v":0},{"$f":"evidence!P285","v":0},0,0,0,{"$f":"evidence!Q285","v":"00:00:00"},1900,2016,0,{"$f":"evidence!S285","v":0},"",null,{"$f":"evidence!F285","v":0},{"$f":"evidence!K285","v":0},null,null,null,0,0,0,0,0,0,0,0,0,0,0,0,0,0,0,0,0,0,0,0,0,null,null,null,null,null,0,0,0,0,0,"RODNE_CISLO",0,0,null,null,null,0,0,0,0,"","",0,0,0,0,0,0,null,null,null,null,null,null,null,null,null,null,null,null,null,null,null,null,null,null,null,null,null,null,null,null,null,null,null,null,null,"","","",null,null,"RODNE_CISLO","","",null,null,null,null,null,null,"","",null,null,"",null,"",null,null,null,""]
[{"$f":"evidence!A286","v":0},{"$f":"IF(ISTEXT(evidence!B286),evidence!B286,\"\")","v":""},{"$f":"evidence!C286","v":0},{"$f":"evidence!D286","v":0},1918,{"$f":"evidence!E286","v":0},{"$f":"evidence!L286","v":0},{"$f":"evidence!M286","v":0},{"$f":"evidence!N286","v":0},{"$f":"evidence!O286","v":0},{"$f":"evidence!P286","v":0},0,0,0,{"$f":"evidence!Q286","v":"00:00:00"},1900,2016,0,{"$f":"evidence!S286","v":0},"",null,{"$f":"evidence!F286","v":0},{"$f":"evidence!K286","v":0},null,null,null,0,0,0,0,0,0,0,0,0,0,0,0,0,0,0,0,0,0,0,0,0,null,null,null,null,null,0,0,0,0,0,"RODNE_CISLO",0,0,null,null,null,0,0,0,0,"","",0,0,0,0,0,0,null,null,null,null,null,null,null,null,null,null,null,null,null,null,null,null,null,null,null,null,null,null,null,null,null,null,null,null,null,"","","",null,null,"RODNE_CISLO","","",null,null,null,null,null,null,"","",null,null,"",null,"",null,null,null,""]
[{"$f":"evidence!A287","v":0},{"$f":"IF(ISTEXT(evidence!B287),evidence!B287,\"\")","v":""},{"$f":"evidence!C287","v":0},{"$f":"evidence!D287","v":0},1918,{"$f":"evidence!E287","v":0},{"$f":"evidence!L287","v":0},{"$f":"evidence!M287","v":0},{"$f":"evidence!N287","v":0},{"$f":"evidence!O287","v":0},{"$f":"evidence!P287","v":0},0,0,0,{"$f":"evidence!Q287","v":"00:00:00"},1900,2016,0,{"$f":"evidence!S287","v":0},"",null,{"$f":"evidence!F287","v":0},{"$f":"evidence!K287","v":0},null,null,null,0,0,0,0,0,0,0,0,0,0,0,0,0,0,0,0,0,0,0,0,0,null,null,null,null,null,0,0,0,0,0,"RODNE_CISLO",0,0,null,null,null,0,0,0,0,"","",0,0,0,0,0,0,null,null,null,null,null,null,null,null,null,null,null,null,null,null,null,null,null,null,null,null,null,null,null,null,null,null,null,null,null,"","","",null,null,"RODNE_CISLO","","",null,null,null,null,null,null,"","",null,null,"",null,"",null,null,null,""]
[{"$f":"evidence!A288","v":0},{"$f":"IF(ISTEXT(evidence!B288),evidence!B288,\"\")","v":""},{"$f":"evidence!C288","v":0},{"$f":"evidence!D288","v":0},1918,{"$f":"evidence!E288","v":0},{"$f":"evidence!L288","v":0},{"$f":"evidence!M288","v":0},{"$f":"evidence!N288","v":0},{"$f":"evidence!O288","v":0},{"$f":"evidence!P288","v":0},0,0,0,{"$f":"evidence!Q288","v":"00:00:00"},1900,2016,0,{"$f":"evidence!S288","v":0},"",null,{"$f":"evidence!F288","v":0},{"$f":"evidence!K288","v":0},null,null,null,0,0,0,0,0,0,0,0,0,0,0,0,0,0,0,0,0,0,0,0,0,null,null,null,null,null,0,0,0,0,0,"RODNE_CISLO",0,0,null,null,null,0,0,0,0,"","",0,0,0,0,0,0,null,null,null,null,null,null,null,null,null,null,null,null,null,null,null,null,null,null,null,null,null,null,null,null,null,null,null,null,null,"","","",null,null,"RODNE_CISLO","","",null,null,null,null,null,null,"","",null,null,"",null,"",null,null,null,""]
[{"$f":"evidence!A289","v":0},{"$f":"IF(ISTEXT(evidence!B289),evidence!B289,\"\")","v":""},{"$f":"evidence!C289","v":0},{"$f":"evidence!D289","v":0},1918,{"$f":"evidence!E289","v":0},{"$f":"evidence!L289","v":0},{"$f":"evidence!M289","v":0},{"$f":"evidence!N289","v":0},{"$f":"evidence!O289","v":0},{"$f":"evidence!P289","v":0},0,0,0,{"$f":"evidence!Q289","v":"00:00:00"},1900,2016,0,{"$f":"evidence!S289","v":0},"",null,{"$f":"evidence!F289","v":0},{"$f":"evidence!K289","v":0},null,null,null,0,0,0,0,0,0,0,0,0,0,0,0,0,0,0,0,0,0,0,0,0,null,null,null,null,null,0,0,0,0,0,"RODNE_CISLO",0,0,null,null,null,0,0,0,0,"","",0,0,0,0,0,0,null,null,null,null,null,null,null,null,null,null,null,null,null,null,null,null,null,null,null,null,null,null,null,null,null,null,null,null,null,"","","",null,null,"RODNE_CISLO","","",null,null,null,null,null,null,"","",null,null,"",null,"",null,null,null,""]
[{"$f":"evidence!A290","v":0},{"$f":"IF(ISTEXT(evidence!B290),evidence!B290,\"\")","v":""},{"$f":"evidence!C290","v":0},{"$f":"evidence!D290","v":0},1918,{"$f":"evidence!E290","v":0},{"$f":"evidence!L290","v":0},{"$f":"evidence!M290","v":0},{"$f":"evidence!N290","v":0},{"$f":"evidence!O290","v":0},{"$f":"evidence!P290","v":0},0,0,0,{"$f":"evidence!Q290","v":"00:00:00"},1900,2016,0,{"$f":"evidence!S290","v":0},"",null,{"$f":"evidence!F290","v":0},{"$f":"evidence!K290","v":0},null,null,null,0,0,0,0,0,0,0,0,0,0,0,0,0,0,0,0,0,0,0,0,0,null,null,null,null,null,0,0,0,0,0,"RODNE_CISLO",0,0,null,null,null,0,0,0,0,"","",0,0,0,0,0,0,null,null,null,null,null,null,null,null,null,null,null,null,null,null,null,null,null,null,null,null,null,null,null,null,null,null,null,null,null,"","","",null,null,"RODNE_CISLO","","",null,null,null,null,null,null,"","",null,null,"",null,"",null,null,null,""]
[{"$f":"evidence!A291","v":0},{"$f":"IF(ISTEXT(evidence!B291),evidence!B291,\"\")","v":""},{"$f":"evidence!C291","v":0},{"$f":"evidence!D291","v":0},1918,{"$f":"evidence!E291","v":0},{"$f":"evidence!L291","v":0},{"$f":"evidence!M291","v":0},{"$f":"evidence!N291","v":0},{"$f":"evidence!O291","v":0},{"$f":"evidence!P291","v":0},0,0,0,{"$f":"evidence!Q291","v":"00:00:00"},1900,2016,0,{"$f":"evidence!S291","v":0},"",null,{"$f":"evidence!F291","v":0},{"$f":"evidence!K291","v":0},null,null,null,0,0,0,0,0,0,0,0,0,0,0,0,0,0,0,0,0,0,0,0,0,null,null,null,null,null,0,0,0,0,0,"RODNE_CISLO",0,0,null,null,null,0,0,0,0,"","",0,0,0,0,0,0,null,null,null,null,null,null,null,null,null,null,null,null,null,null,null,null,null,null,null,null,null,null,null,null,null,null,null,null,null,"","","",null,null,"RODNE_CISLO","","",null,null,null,null,null,null,"","",null,null,"",null,"",null,null,null,""]
[{"$f":"evidence!A292","v":0},{"$f":"IF(ISTEXT(evidence!B292),evidence!B292,\"\")","v":""},{"$f":"evidence!C292","v":0},{"$f":"evidence!D292","v":0},1918,{"$f":"evidence!E292","v":0},{"$f":"evidence!L292","v":0},{"$f":"evidence!M292","v":0},{"$f":"evidence!N292","v":0},{"$f":"evidence!O292","v":0},{"$f":"evidence!P292","v":0},0,0,0,{"$f":"evidence!Q292","v":"00:00:00"},1900,2016,0,{"$f":"evidence!S292","v":0},"",null,{"$f":"evidence!F292","v":0},{"$f":"evidence!K292","v":0},null,null,null,0,0,0,0,0,0,0,0,0,0,0,0,0,0,0,0,0,0,0,0,0,null,null,null,null,null,0,0,0,0,0,"RODNE_CISLO",0,0,null,null,null,0,0,0,0,"","",0,0,0,0,0,0,null,null,null,null,null,null,null,null,null,null,null,null,null,null,null,null,null,null,null,null,null,null,null,null,null,null,null,null,null,"","","",null,null,"RODNE_CISLO","","",null,null,null,null,null,null,"","",null,null,"",null,"",null,null,null,""]
[{"$f":"evidence!A293","v":0},{"$f":"IF(ISTEXT(evidence!B293),evidence!B293,\"\")","v":""},{"$f":"evidence!C293","v":0},{"$f":"evidence!D293","v":0},1918,{"$f":"evidence!E293","v":0},{"$f":"evidence!L293","v":0},{"$f":"evidence!M293","v":0},{"$f":"evidence!N293","v":0},{"$f":"evidence!O293","v":0},{"$f":"evidence!P293","v":0},0,0,0,{"$f":"evidence!Q293","v":"00:00:00"},1900,2016,0,{"$f":"evidence!S293","v":0},"",null,{"$f":"evidence!F293","v":0},{"$f":"evidence!K293","v":0},null,null,null,0,0,0,0,0,0,0,0,0,0,0,0,0,0,0,0,0,0,0,0,0,null,null,null,null,null,0,0,0,0,0,"RODNE_CISLO",0,0,null,null,null,0,0,0,0,"","",0,0,0,0,0,0,null,null,null,null,null,null,null,null,null,null,null,null,null,null,null,null,null,null,null,null,null,null,null,null,null,null,null,null,null,"","","",null,null,"RODNE_CISLO","","",null,null,null,null,null,null,"","",null,null,"",null,"",null,null,null,""]
[{"$f":"evidence!A294","v":0},{"$f":"IF(ISTEXT(evidence!B294),evidence!B294,\"\")","v":""},{"$f":"evidence!C294","v":0},{"$f":"evidence!D294","v":0},1918,{"$f":"evidence!E294","v":0},{"$f":"evidence!L294","v":0},{"$f":"evidence!M294","v":0},{"$f":"evidence!N294","v":0},{"$f":"evidence!O294","v":0},{"$f":"evidence!P294","v":0},0,0,0,{"$f":"evidence!Q294","v":"00:00:00"},1900,2016,0,{"$f":"evidence!S294","v":0},"",null,{"$f":"evidence!F294","v":0},{"$f":"evidence!K294","v":0},null,null,null,0,0,0,0,0,0,0,0,0,0,0,0,0,0,0,0,0,0,0,0,0,null,null,null,null,null,0,0,0,0,0,"RODNE_CISLO",0,0,null,null,null,0,0,0,0,"","",0,0,0,0,0,0,null,null,null,null,null,null,null,null,null,null,null,null,null,null,null,null,null,null,null,null,null,null,null,null,null,null,null,null,null,"","","",null,null,"RODNE_CISLO","","",null,null,null,null,null,null,"","",null,null,"",null,"",null,null,null,""]
[{"$f":"evidence!A295","v":0},{"$f":"IF(ISTEXT(evidence!B295),evidence!B295,\"\")","v":""},{"$f":"evidence!C295","v":0},{"$f":"evidence!D295","v":0},1918,{"$f":"evidence!E295","v":0},{"$f":"evidence!L295","v":0},{"$f":"evidence!M295","v":0},{"$f":"evidence!N295","v":0},{"$f":"evidence!O295","v":0},{"$f":"evidence!P295","v":0},0,0,0,{"$f":"evidence!Q295","v":"00:00:00"},1900,2016,0,{"$f":"evidence!S295","v":0},"",null,{"$f":"evidence!F295","v":0},{"$f":"evidence!K295","v":0},null,null,null,0,0,0,0,0,0,0,0,0,0,0,0,0,0,0,0,0,0,0,0,0,null,null,null,null,null,0,0,0,0,0,"RODNE_CISLO",0,0,null,null,null,0,0,0,0,"","",0,0,0,0,0,0,null,null,null,null,null,null,null,null,null,null,null,null,null,null,null,null,null,null,null,null,null,null,null,null,null,null,null,null,null,"","","",null,null,"RODNE_CISLO","","",null,null,null,null,null,null,"","",null,null,"",null,"",null,null,null,""]
[{"$f":"evidence!A296","v":0},{"$f":"IF(ISTEXT(evidence!B296),evidence!B296,\"\")","v":""},{"$f":"evidence!C296","v":0},{"$f":"evidence!D296","v":0},1918,{"$f":"evidence!E296","v":0},{"$f":"evidence!L296","v":0},{"$f":"evidence!M296","v":0},{"$f":"evidence!N296","v":0},{"$f":"evidence!O296","v":0},{"$f":"evidence!P296","v":0},0,0,0,{"$f":"evidence!Q296","v":"00:00:00"},1900,2016,0,{"$f":"evidence!S296","v":0},"",null,{"$f":"evidence!F296","v":0},{"$f":"evidence!K296","v":0},null,null,null,0,0,0,0,0,0,0,0,0,0,0,0,0,0,0,0,0,0,0,0,0,null,null,null,null,null,0,0,0,0,0,"RODNE_CISLO",0,0,null,null,null,0,0,0,0,"","",0,0,0,0,0,0,null,null,null,null,null,null,null,null,null,null,null,null,null,null,null,null,null,null,null,null,null,null,null,null,null,null,null,null,null,"","","",null,null,"RODNE_CISLO","","",null,null,null,null,null,null,"","",null,null,"",null,"",null,null,null,""]
[{"$f":"evidence!A297","v":0},{"$f":"IF(ISTEXT(evidence!B297),evidence!B297,\"\")","v":""},{"$f":"evidence!C297","v":0},{"$f":"evidence!D297","v":0},1918,{"$f":"evidence!E297","v":0},{"$f":"evidence!L297","v":0},{"$f":"evidence!M297","v":0},{"$f":"evidence!N297","v":0},{"$f":"evidence!O297","v":0},{"$f":"evidence!P297","v":0},0,0,0,{"$f":"evidence!Q297","v":"00:00:00"},1900,2016,0,{"$f":"evidence!S297","v":0},"",null,{"$f":"evidence!F297","v":0},{"$f":"evidence!K297","v":0},null,null,null,0,0,0,0,0,0,0,0,0,0,0,0,0,0,0,0,0,0,0,0,0,null,null,null,null,null,0,0,0,0,0,"RODNE_CISLO",0,0,null,null,null,0,0,0,0,"","",0,0,0,0,0,0,null,null,null,null,null,null,null,null,null,null,null,null,null,null,null,null,null,null,null,null,null,null,null,null,null,null,null,null,null,"","","",null,null,"RODNE_CISLO","","",null,null,null,null,null,null,"","",null,null,"",null,"",null,null,null,""]
[{"$f":"evidence!A298","v":0},{"$f":"IF(ISTEXT(evidence!B298),evidence!B298,\"\")","v":""},{"$f":"evidence!C298","v":0},{"$f":"evidence!D298","v":0},1918,{"$f":"evidence!E298","v":0},{"$f":"evidence!L298","v":0},{"$f":"evidence!M298","v":0},{"$f":"evidence!N298","v":0},{"$f":"evidence!O298","v":0},{"$f":"evidence!P298","v":0},0,0,0,{"$f":"evidence!Q298","v":"00:00:00"},1900,2016,0,{"$f":"evidence!S298","v":0},"",null,{"$f":"evidence!F298","v":0},{"$f":"evidence!K298","v":0},null,null,null,0,0,0,0,0,0,0,0,0,0,0,0,0,0,0,0,0,0,0,0,0,null,null,null,null,null,0,0,0,0,0,"RODNE_CISLO",0,0,null,null,null,0,0,0,0,"","",0,0,0,0,0,0,null,null,null,null,null,null,null,null,null,null,null,null,null,null,null,null,null,null,null,null,null,null,null,null,null,null,null,null,null,"","","",null,null,"RODNE_CISLO","","",null,null,null,null,null,null,"","",null,null,"",null,"",null,null,null,""]
[{"$f":"evidence!A299","v":0},{"$f":"IF(ISTEXT(evidence!B299),evidence!B299,\"\")","v":""},{"$f":"evidence!C299","v":0},{"$f":"evidence!D299","v":0},1918,{"$f":"evidence!E299","v":0},{"$f":"evidence!L299","v":0},{"$f":"evidence!M299","v":0},{"$f":"evidence!N299","v":0},{"$f":"evidence!O299","v":0},{"$f":"evidence!P299","v":0},0,0,0,{"$f":"evidence!Q299","v":"00:00:00"},1900,2016,0,{"$f":"evidence!S299","v":0},"",null,{"$f":"evidence!F299","v":0},{"$f":"evidence!K299","v":0},null,null,null,0,0,0,0,0,0,0,0,0,0,0,0,0,0,0,0,0,0,0,0,0,null,null,null,null,null,0,0,0,0,0,"RODNE_CISLO",0,0,null,null,null,0,0,0,0,"","",0,0,0,0,0,0,null,null,null,null,null,null,null,null,null,null,null,null,null,null,null,null,null,null,null,null,null,null,null,null,null,null,null,null,null,"","","",null,null,"RODNE_CISLO","","",null,null,null,null,null,null,"","",null,null,"",null,"",null,null,null,""]
[{"$f":"evidence!A300","v":0},{"$f":"IF(ISTEXT(evidence!B300),evidence!B300,\"\")","v":""},{"$f":"evidence!C300","v":0},{"$f":"evidence!D300","v":0},1918,{"$f":"evidence!E300","v":0},{"$f":"evidence!L300","v":0},{"$f":"evidence!M300","v":0},{"$f":"evidence!N300","v":0},{"$f":"evidence!O300","v":0},{"$f":"evidence!P300","v":0},0,0,0,{"$f":"evidence!Q300","v":"00:00:00"},1900,2016,0,{"$f":"evidence!S300","v":0},"",null,{"$f":"evidence!F300","v":0},{"$f":"evidence!K300","v":0},null,null,null,0,0,0,0,0,0,0,0,0,0,0,0,0,0,0,0,0,0,0,0,0,null,null,null,null,null,0,0,0,0,0,"RODNE_CISLO",0,0,null,null,null,0,0,0,0,"","",0,0,0,0,0,0,null,null,null,null,null,null,null,null,null,null,null,null,null,null,null,null,null,null,null,null,null,null,null,null,null,null,null,null,null,"","","",null,null,"RODNE_CISLO","","",null,null,null,null,null,null,"","",null,null,"",null,"",null,null,null,""]
[{"$f":"evidence!A301","v":0},{"$f":"IF(ISTEXT(evidence!B301),evidence!B301,\"\")","v":""},{"$f":"evidence!C301","v":0},{"$f":"evidence!D301","v":0},1918,{"$f":"evidence!E301","v":0},{"$f":"evidence!L301","v":0},{"$f":"evidence!M301","v":0},{"$f":"evidence!N301","v":0},{"$f":"evidence!O301","v":0},{"$f":"evidence!P301","v":0},0,0,0,{"$f":"evidence!Q301","v":"00:00:00"},1900,2016,0,{"$f":"evidence!S301","v":0},"",null,{"$f":"evidence!F301","v":0},{"$f":"evidence!K301","v":0},null,null,null,0,0,0,0,0,0,0,0,0,0,0,0,0,0,0,0,0,0,0,0,0,null,null,null,null,null,0,0,0,0,0,"RODNE_CISLO",0,0,null,null,null,0,0,0,0,"","",0,0,0,0,0,0,null,null,null,null,null,null,null,null,null,null,null,null,null,null,null,null,null,null,null,null,null,null,null,null,null,null,null,null,null,"","","",null,null,"RODNE_CISLO","","",null,null,null,null,null,null,"","",null,null,"",null,"",null,null,null,""]
[{"$f":"evidence!A302","v":0},{"$f":"IF(ISTEXT(evidence!B302),evidence!B302,\"\")","v":""},{"$f":"evidence!C302","v":0},{"$f":"evidence!D302","v":0},1918,{"$f":"evidence!E302","v":0},{"$f":"evidence!L302","v":0},{"$f":"evidence!M302","v":0},{"$f":"evidence!N302","v":0},{"$f":"evidence!O302","v":0},{"$f":"evidence!P302","v":0},0,0,0,{"$f":"evidence!Q302","v":"00:00:00"},1900,2016,0,{"$f":"evidence!S302","v":0},"",null,{"$f":"evidence!F302","v":0},{"$f":"evidence!K302","v":0},null,null,null,0,0,0,0,0,0,0,0,0,0,0,0,0,0,0,0,0,0,0,0,0,null,null,null,null,null,0,0,0,0,0,"RODNE_CISLO",0,0,null,null,null,0,0,0,0,"","",0,0,0,0,0,0,null,null,null,null,null,null,null,null,null,null,null,null,null,null,null,null,null,null,null,null,null,null,null,null,null,null,null,null,null,"","","",null,null,"RODNE_CISLO","","",null,null,null,null,null,null,"","",null,null,"",null,"",null,null,null,""]
[{"$f":"evidence!A303","v":0},{"$f":"IF(ISTEXT(evidence!B303),evidence!B303,\"\")","v":""},{"$f":"evidence!C303","v":0},{"$f":"evidence!D303","v":0},1918,{"$f":"evidence!E303","v":0},{"$f":"evidence!L303","v":0},{"$f":"evidence!M303","v":0},{"$f":"evidence!N303","v":0},{"$f":"evidence!O303","v":0},{"$f":"evidence!P303","v":0},0,0,0,{"$f":"evidence!Q303","v":"00:00:00"},1900,2016,0,{"$f":"evidence!S303","v":0},"",null,{"$f":"evidence!F303","v":0},{"$f":"evidence!K303","v":0},null,null,null,{"$f":"IF((T305=\"ANO\"),A305,0)","v":0},{"$f":"IF((T305=\"ANO\"),B305,0)","v":0},{"$f":"IF((T305=\"ANO\"),C305,0)","v":0},{"$f":"IF((T305=\"ANO\"),D305,0)","v":0},{"$f":"IF((T305=\"ANO\"),E305,0)","v":0},{"$f":"IF((T305=\"ANO\"),F305,0)","v":0},{"$f":"IF((T305=\"ANO\"),G305,0)","v":0},{"$f":"IF((T305=\"ANO\"),H305,0)","v":0},{"$f":"IF((T305=\"ANO\"),I305,0)","v":0},{"$f":"IF((T305=\"ANO\"),J305,0)","v":0},{"$f":"IF((T305=\"ANO\"),K305,0)","v":0},{"$f":"IF((T305=\"ANO\"),L305,0)","v":0},{"$f":"IF((T305=\"ANO\"),M305,0)","v":0},{"$f":"IF((T305=\"ANO\"),N305,0)","v":0},{"$f":"IF((T305=\"ANO\"),O305,0)","v":0},{"$f":"IF((T305=\"ANO\"),P305,0)","v":0},{"$f":"IF((T305=\"ANO\"),Q305,0)","v":0},{"$f":"IF((T305=\"ANO\"),R305,0)","v":0},{"$f":"IF((T305=\"ANO\"),S305,0)","v":0},0,0,null,null,null,null,null,0,0,0,0,0,"RODNE_CISLO",0,0,null,null,null,0,0,0,0,"","",0,0,0,0,0,0,null,null,null,null,null,null,null,null,null,null,null,null,null,null,null,null,null,null,null,null,null,null,null,null,null,null,null,null,null,"","","",null,null,"RODNE_CISLO","","",null,null,null,null,null,null,"","",null,null,"",null,"",null,null,null,""]

{"sheet":"data1","index":3,"n_rows":19,"n_cols":78,"rows_kept":19,"cut":false,"hidden":false,"merged":[]}
["JMENO","PRIJMENI","TITUL_PRED","TITUL_ZA","RODNE_CISLO","OBCANSTVI","DATUM_NAROZENI","NAZEV_OBCE","NAZEV_CASTI_OBCE","NAZEV_ULICE","CISLO_POPISNE","CISLO_ORIENTACNI","PSC","SPORTOVEC","SPORTOVCEM_OD","SPORTOVCEM_DO","SPORTOVEC_CETNOST","SPORTOVEC_DRUH_SPORTU",null,"TRENER","TRENEREM_OD","TRENEREM_DO","TRENER_CETNOST","TRENER_DRUH_SPORTU","EXT_ID",null,"JMENO","PRIJMENI","TITUL_PRED","TITUL_ZA","RODNE_CISLO","OBCANSTVI","DATUM_NAROZENI","NAZEV_OBCE","NAZEV_CASTI_OBCE","NAZEV_ULICE","CISLO_POPISNE","CISLO_ORIENTACNI","PSC","SPORTOVEC","SPORTOVCEM_OD","SPORTOVCEM_DO","SPORTOVEC_CETNOST","SPORTOVEC_DRUH_SPORTU","SPORTOVEC_UCAST_SOUTEZE","TRENER","TRENEREM_OD","TRENEREM_DO","TRENER_CETNOST","TRENER_DRUH_SPORTU","EXT_ID",null,"JMENO","PRIJMENI","TITUL_PRED","TITUL_ZA","RODNE_CISLO","OBCANSTVI","DATUM_NAROZENI","NAZEV_OBCE","NAZEV_CASTI_OBCE","NAZEV_ULICE","CISLO_POPISNE","CISLO_ORIENTACNI","PSC","SPORTOVEC","SPORTOVCEM_OD","SPORTOVCEM_DO","SPORTOVEC_CETNOST","SPORTOVEC_DRUH_SPORTU","SPORTOVEC_UCAST_SOUTEZE","TRENER","TRENEREM_OD","TRENEREM_DO","TRENER_CETNOST","TRENER_DRUH_SPORTU","EXT_ID"]
[null,null,null,null,null,null,null,null,null,null,null,null,null,null,null,null,null,null,null,null,null,null,null,null,null,null,null,null,null,null,null,null,null,null,null,null,null,null,null,null,null,null,null,null,null,null,null,null,null,null,null,null,"Jméno 01","Příjmení 01",null,null,"0910109999","CZE","10.10.2009",null,null,null,null,null,null,1,"22.08.2016",null,1,86,null,0,null,null,null,86,null,"Test 1 99999999"]
[null,null,null,null,null,null,null,null,null,null,null,null,null,null,null,null,null,null,null,null,null,null,null,null,null,null,null,null,null,null,null,null,null,null,null,null,null,null,null,null,null,null,null,null,null,null,null,null,null,null,null,null,"Jméno 02","Příjmení 02",null,null,"1002259999","CZE","25.02.2010",null,null,null,null,null,null,1,"22.08.2016",null,1,86,null,0,null,null,null,86]
[null,null,null,null,null,null,null,null,null,null,null,null,null,null,null,null,null,null,null,null,null,null,null,null,null,null,null,null,null,null,null,null,null,null,null,null,null,null,null,null,null,null,null,null,null,null,null,null,null,null,null,null,"Jméno 03","Příjmení 03",null,null,"1161249999","CZE","24.11.2011",null,null,null,null,null,null,1,"24.08.2016",null,1,86,null,0,null,null,null,86]
[null,null,null,null,null,null,null,null,null,null,null,null,null,null,null,null,null,null,null,null,null,null,null,null,null,null,null,null,null,null,null,null,null,null,null,null,null,null,null,null,null,null,null,null,null,null,null,null,null,null,null,null,"Jméno 04","Příjmení 04",null,null,"1012079999","CZE","07.12.2010",null,null,null,null,null,null,1,"24.08.2016",null,1,86,null,0,null,null,null,86]
[null,null,null,null,null,null,null,null,null,null,null,null,null,null,null,null,null,null,null,null,null,null,null,null,null,null,null,null,null,null,null,null,null,null,null,null,null,null,null,null,null,null,null,null,null,null,null,null,null,null,null,null,"Jméno 06","Příjmení 06",null,null,"1108079999","CZE","07.08.2011",null,null,null,null,null,null,1,"07.09.2016",null,1,86,null,0,null,null,null,86]
[null,null,null,null,null,null,null,null,null,null,null,null,null,null,null,null,null,null,null,null,null,null,null,null,null,null,null,null,null,null,null,null,null,null,null,null,null,null,null,null,null,null,null,null,null,null,null,null,null,null,null,null,"Jméno 07","Příjmení 07",null,null,"7004019999","CZE","01.04.1970",null,null,null,null,null,null,0,"19.04.2017",null,null,86,null,1,null,null,null,86]
[null,null,null,null,null,null,null,null,null,null,null,null,null,null,null,null,null,null,null,null,null,null,null,null,null,null,null,null,null,null,null,null,null,null,null,null,null,null,null,null,null,null,null,null,null,null,null,null,null,null,null,null,"Jméno 08","Příjmení 08",null,null,"1005219999","CZE","21.05.2010",null,null,null,null,null,null,1,"01.06.2017",null,null,86,null,0,null,null,null,86]
[null,null,null,null,null,null,null,null,null,null,null,null,null,null,null,null,null,null,null,null,null,null,null,null,null,null,null,null,null,null,null,null,null,null,null,null,null,null,null,null,null,null,null,null,null,null,null,null,null,null,null,null,"Jméno 09","Příjmení 09",null,null,"0853079999","CZE","07.03.2008",null,null,null,null,null,null,1,"22.08.2012",null,null,86,null,0,null,null,null,86]
[null,null,null,null,null,null,null,null,null,null,null,null,null,null,null,null,null,null,null,null,null,null,null,null,null,null,null,null,null,null,null,null,null,null,null,null,null,null,null,null,null,null,null,null,null,null,null,null,null,null,null,null,"Jméno 10","Příjmení 10",null,null,"0604159999","CZE","15.04.2006",null,null,null,null,null,null,1,"01.06.2017",null,null,86,null,0,null,null,null,86]
[null,null,null,null,null,null,null,null,null,null,null,null,null,null,null,null,null,null,null,null,null,null,null,null,null,null,null,null,null,null,null,null,null,null,null,null,null,null,null,null,null,null,null,null,null,null,null,null,null,null,null,null,"Jméno 11","Příjmení 11",null,null,"0510289999","CZE","28.10.2005",null,null,null,null,null,null,1,"04.10.2017",null,null,86,null,0,null,null,null,86]
[null,null,null,null,null,null,null,null,null,null,null,null,null,null,null,null,null,null,null,null,null,null,null,null,null,null,null,null,null,null,null,null,null,null,null,null,null,null,null,null,null,null,null,null,null,null,null,null,null,null,null,null,"Jméno 12","Příjmení 12",null,null,"0604179999","CZE","17.04.2006",null,null,null,null,null,null,1,"09.10.2017",null,null,86,null,0,null,null,null,86]
[null,null,null,null,null,null,null,null,null,null,null,null,null,null,null,null,null,null,null,null,null,null,null,null,null,null,null,null,null,null,null,null,null,null,null,null,null,null,null,null,null,null,null,null,null,null,null,null,null,null,null,null,"Jméno 13","Příjmení 13",null,null,"0260239999","CZE","23.10.2002",null,null,null,null,null,null,1,"31.01.2018",null,null,86,null,0,null,null,null,86]
[null,null,null,null,null,null,null,null,null,null,null,null,null,null,null,null,null,null,null,null,null,null,null,null,null,null,null,null,null,null,null,null,null,null,null,null,null,null,null,null,null,null,null,null,null,null,null,null,null,null,null,null,"Jméno 14","Příjmení 14",null,null,"6705229999","CZE","22.05.1967",null,null,null,null,null,null,1,"31.01.2018",null,null,86,null,0,null,null,null,86]
[null,null,null,null,null,null,null,null,null,null,null,null,null,null,null,null,null,null,null,null,null,null,null,null,null,null,null,null,null,null,null,null,null,null,null,null,null,null,null,null,null,null,null,null,null,null,null,null,null,null,null,null,"Jméno 15","Příjmení 15",null,null,"6661289999","CZE","28.11.1966",null,null,null,null,null,null,1,"31.01.2018",null,null,86,null,0,null,null,null,86]
[null,null,null,null,null,null,null,null,null,null,null,null,null,null,null,null,null,null,null,null,null,null,null,null,null,null,null,null,null,null,null,null,null,null,null,null,null,null,null,null,null,null,null,null,null,null,null,null,null,null,null,null,"Jméno 16","Příjmení 16",null,null,"0559189999","CZE","18.09.2005",null,null,null,null,null,null,1,"24.05.2018",null,null,86,null,0,null,null,null,86]
[null,null,null,null,null,null,null,null,null,null,null,null,null,null,null,null,null,null,null,null,null,null,null,null,null,null,null,null,null,null,null,null,null,null,null,null,null,null,null,null,null,null,null,null,null,null,null,null,null,null,null,null,"Jméno 17","Příjmení 17",null,null,"0851319999","CZE","31.01.2008",null,null,null,null,null,null,1,"12.06.2019",null,null,86,null,0,null,null,null,86]
[null,null,null,null,null,null,null,null,null,null,null,null,null,null,null,null,null,null,null,null,null,null,null,null,null,null,null,null,null,null,null,null,null,null,null,null,null,null,null,null,null,null,null,null,null,null,null,null,null,null,null,null,"Jméno 18","Příjmení 18",null,null,"1202299999","CZE","29.02.2012",null,null,null,null,null,null,1,"26.06.2019",null,null,86,null,0,null,null,null,86]
[null,null,null,null,null,null,null,null,null,null,null,null,null,null,null,null,null,null,null,null,null,null,null,null,null,null,null,null,null,null,null,null,null,null,null,null,null,null,null,null,null,null,null,null,null,null,null,null,null,null,null,null,"Jméno 19","Příjmení 19",null,null,"1102019999","CZE","01.02.2011",null,null,null,null,null,null,1,"26.06.2019",null,null,86,null,0,null,null,null,86]

{"sheet":"Nápověda","index":4,"n_rows":30,"n_cols":4,"rows_kept":30,"cut":false,"hidden":false,"merged":[]}
[null,"Návod na použití programu",null,"Kontakt:"]
[null,"Program Registr sportovců slouží k přípravě souboru *.csv pro Rejstřík sportu",null,"Vlastimil Nevařil"]
[null,null,null,"Mobil 722 530 073"]
[null,"Kdekoliv ve svém počítači vytvoř novou složku.",null,"kancelar@oshzlin.cz"]
[null,"Otevři zkomprimovaný soubor *.zip a program ulož do složky. NESMÍŠ jej přejmenovat, jinak nebude fungovat."]
[null,"Po spuštění musíš povolit Obsah, nebo Makra, dle verze Office."]
[null,"Přihlas se do centrální evidence SH ČMS -  https://www.evidencesdh.cz."]
[null,"Klikni - Správa členů/Export pro sport a soubor export_clenu.xls  a soubor ulož"]
[null,"Z nabídky vyber Uložit, nebo Uložit jako"]
[null,"Pokud klikneš na tlačítko Uložit, soubor se uloží do složky Downloads (Stažené soubory)"]
[null,"Pokud klikneš na tlačítko Uložit jako, můžeš si vybrat složku, do které soubor uložíš (například do složky, kde máš uložený program Registr sportovců SDH"]
[null,"/SPRÁVA ČLENŮ/EXPORT PRO SPORT/ a soubor ulož do nově vytvořené složky."]
[null,"Zavři prohlížeč."]
[null,"V programu registrsdh_novy klikni na tlačítko 1. IMPORT *.csv."]
[null,"Najdi uložený soubor export_clenu.xls a klikni na tlačítko Otevřít."]
[null,"V buňkách označených modře doplň údaje:"]
[null," - SPORTOVEC_CETNOST"]
[null,"          1    Pokud trénuje 1x týdně"]
[null,"          2    Pokud trénuje 2x týdně"]
[null," - SPORTOVEC_UCAST_SOUTEZE"]
[null,"          0    Pokud se za posledních 24 měsíců zůčastnil méně jak 6. soutěží"]
[null,"          1    Pokud se za posledních 24 měsíců zůčastnil alespoň 6. soutěží"]
[null," - TRENEREM_OD: "]
[null,"          Napiš datum od kdy je trenérem ve formátu textu"]
[null," - TRENER_CETNOST"]
[null,"          1    Pokud trénuje 1 x týdně"]
[null,"          2    Pokud trénuje 2 x týdně"]
[null,"Klikni na tlačítko EXPORT  *.csv."]
[null,"Program ihned vygeneruje soubor ve formátu k uložení do Rejstříku sportu. Název souboru je složený z názvu SDH a IČ a je uložen ve složce, ve které jste otevřeli program"]
[null,"Vytvořený soubor NEOTVÝREJ. Pokud ho otevřeš, NEUKLÁDEJ. Při uložení dojde ke ztrátě nul u rodných čísel ročníků 2000, 2001, 2002, 2003 ….. a soubor nebude možné importovat do NSA."]